program: Gaussian 09
title: /home/michael/molsimp_comfiles/Co_31a_17_OH/Co_31a_17_OH.com auto generated
version: ES64L-G09RevE.01
frameworkgroup: C1[X(C28H20CoN4O4)]
method: UTPSSh
basis: Gen
operation: Freq
keyword: #P
keyword: Geom=AllCheck
keyword: Guess=TCheck
keyword: SCRF=Check
keyword: GenChk
keyword: UTPSSh/ChkBas
keyword: Freq
title: /home/michael/molsimp_comfiles/Co_31a_17_OH/Co_31a_17_OH.com auto gene
converged: YES YES NO YES
polarizability: 7.16365348e+02 -2.20735400e+01 7.24156414e+02 -1.63184725e+00 -5.13881370e+01 4.32730741e+02
1716.lowfreq: -8.0713 -3.5862 -0.0001 0.0006 0.0007 5.6761 23.7024 25.1266 33.4651
frequency: 23.6983 24.9657 33.4142 39.3349 46.6247 57.8976 61.2462 82.1473 90.5084 117.1149 124.2935 133.4304 153.2831 165.5670 173.6432 187.4151 191.1797 199.3241 210.3262 212.9589 226.3996 242.5480 254.5918 262.7466 293.1518 305.7300 312.0894 325.3215 360.6161 370.8094 385.3601 395.9238 397.7850 401.1110 422.0835 449.8562 459.0293 477.6328 482.0748 487.8735 500.9503 505.0941 512.7318 522.8685 534.4825 545.7754 550.8138 579.1299 591.3143 615.6661 635.1417 641.6180 643.8084 647.8027 652.3194 658.6172 695.5883 699.7974 703.3805 738.3132 747.4441 760.0859 763.3543 768.8075 771.8158 776.5004 789.1110 802.6742 818.1470 832.1705 840.4503 858.9358 861.4739 888.8086 889.1174 896.3913 924.2468 945.3417 948.9099 964.9545 970.7390 973.6680 983.8289 987.6272 990.8327 1001.6542 1002.5162 1015.7565 1029.1546 1029.2929 1036.6149 1040.2385 1048.5198 1057.1087 1071.5786 1074.4498 1091.2674 1105.2467 1111.7284 1156.5114 1160.4160 1170.9094 1172.1705 1173.3306 1174.9839 1191.2792 1221.3769 1232.5742 1246.7969 1252.6466 1263.4029 1279.5411 1292.5680 1295.2281 1315.9292 1328.0519 1336.5853 1355.0026 1374.2153 1383.1218 1383.9620 1406.0405 1428.2070 1432.1877 1436.3132 1471.8302 1475.1428 1478.3196 1481.0318 1493.8115 1502.4963 1522.3088 1528.6746 1543.7610 1549.6411 1565.5770 1594.9110 1610.4529 1623.5718 1642.1860 1642.6285 1650.0274 1653.1537 1663.2240 1673.4889 3189.5748 3196.0226 3199.4880 3204.0541 3210.5876 3212.7749 3213.8153 3218.2103 3219.1002 3221.9172 3224.1764 3225.4144 3225.5880 3231.5585 3233.3137 3236.2377 3246.1255 3256.0669 3257.5090 3619.6635
redmass: 6.3536 5.8136 6.4935 5.3384 4.2771 4.5687 4.9113 5.8547 6.9419 6.8749 5.4223 5.9861 6.8148 7.6102 7.2513 4.9447 4.6161 5.7743 8.9550 5.9819 6.9211 7.5124 10.3834 7.5385 8.0483 7.3520 7.1649 7.8054 6.4604 7.3863 9.8975 2.9468 2.9153 5.7685 10.4787 3.7101 4.3667 2.8753 3.1077 5.1210 5.0686 1.6348 10.2678 6.8351 3.3153 7.5039 5.6513 3.8707 7.0462 8.0011 7.8390 6.8826 6.7105 3.4774 6.3104 5.6904 5.9616 5.2576 1.7819 7.1108 4.1108 1.7987 1.2565 1.5320 1.7452 3.6798 4.7361 8.1003 2.8394 6.0334 1.3779 1.5677 5.3476 1.3914 1.2543 6.3890 1.3923 1.4565 1.3413 4.9796 1.3078 1.3190 1.2851 1.3792 1.2738 8.1269 1.4271 1.2987 3.2499 1.5753 6.8393 2.3483 6.3554 2.1202 1.8576 2.5477 1.6958 1.7361 2.9931 1.4973 1.5645 1.2370 1.0802 1.1784 1.1165 1.3435 2.5038 1.2288 2.1195 1.6160 2.3370 1.6424 2.5573 1.8210 3.7953 8.2838 4.9158 4.9228 6.6394 2.8724 1.3199 1.8183 3.9470 7.4899 3.7769 4.6695 2.4029 2.7852 2.2436 2.1676 2.8875 1.9833 3.6460 3.3326 9.8832 5.2919 6.1053 6.5778 5.4452 5.5782 5.8588 7.3687 5.2403 7.1257 6.1116 1.0888 1.0876 1.0866 1.0891 1.0939 1.0875 1.0951 1.0884 1.0914 1.0920 1.0981 1.0969 1.0918 1.0901 1.0968 1.0952 1.0964 1.0942 1.0938 1.0828
irintensity: 5.0985 2.7514 13.9005 1.7302 0.5274 2.0690 1.0312 2.3754 4.8755 0.6849 1.9145 0.4498 5.1834 4.6020 0.8314 0.1032 6.1317 1.4947 6.9562 4.7405 1.5889 8.1695 6.2104 5.4242 2.3922 6.6305 2.6835 24.6753 17.5769 57.8623 22.8950 1.2884 1.6137 10.6136 1.0759 15.2094 23.9234 12.9705 5.6816 33.7418 0.5718 134.2824 96.0641 1.3630 3.2813 7.0990 44.8004 2.1419 19.5472 16.7181 5.0402 4.0647 15.4526 11.2802 1.3185 3.3804 7.3915 12.4653 97.5048 7.4826 8.5149 169.3541 35.7708 39.8197 42.1600 4.4332 0.1108 76.5069 6.6496 10.1229 83.7913 10.6291 55.6852 13.1453 0.6654 30.2879 0.4372 13.1539 4.3596 2.8287 3.0311 0.2529 1.2418 7.3056 0.3016 1.2283 0.3816 0.0169 5.6338 1.5048 9.1109 10.7271 0.5971 22.5561 34.0756 36.9651 37.6347 2.6295 15.6514 5.1651 48.8709 0.6390 3.8421 15.4447 4.8815 35.4097 161.2931 25.1548 18.9686 0.8855 60.2935 2.6424 95.2515 26.4377 358.2282 7.3515 22.9239 727.4397 201.8477 1.2324 16.2354 41.9491 144.6522 31.2994 7.5923 74.9477 5.8563 115.9022 55.8414 5.0648 446.8564 34.3569 271.0349 20.7327 1583.2686 248.9391 69.3544 2.6853 2.7662 61.6111 207.0383 5.2656 33.1160 46.7336 72.8348 12.2979 4.1017 1.5330 0.5657 33.3676 3.8083 30.7929 4.1917 7.5640 0.5285 33.4067 35.7651 7.9820 1.9955 16.5352 1.7140 9.5881 6.2744 13.4125 285.9650
temp: 298.150 k
press: 1.00000 atm
elementType: 27 8 6 8 6 6 6 6 6 7 6 6 6 6 6 6 6 8 7 6 1 1 1 1 1 1 1 1 7 6 6 6 6 6 6 6 6 6 1 1 1 1 1 1 1 7 6 6 6 6 6 1 1 1 1 1 8
symmnumber: 1
zpe: 1124236.5 jmol-1
zpe.correction: 0.428199 hartree
zpe.thermalcorrener: 0.457925 hartree
zpe.thermalcorrenthalpy: 0.458869 hartree
zpe.thermalcorrgfe: 0.366878 hartree
zpe.sumelectzpe: -1743.780546 hartree
zpe.sumelectthermal: -1743.750820 hartree
zpe.sumelectthermalent: -1743.749876 hartree
zpe.sumelectthermalfe: -1743.841867 hartree
dipole: 2.1124 11.9157 10.8262
dipole: 16.2374
quadrupole: -109.2603 -232.2511 -199.9969
quadrupole: -8.1044 2.0468 -5.4103
quadrupole: 71.2425 -51.7484 -19.4941 -8.1044 2.0468 -5.4103
hfenergy: -1744.208745 hartree
pointgroup: C01 [X(C28H20Co1N4O4)]
dipole: 0.8382844 4.6832723 4.2631278 debye
polarizability: 716.2812221|-22.0340715|724.3167018|-1.6206035|-51.1824972|432.6545796 unknown
InChI: InChI=1S/C14H8N2O3.C9H7N.C5H5N.Co.O/c17-11-7-2-1-4-8(11)13-15-10-6-3-5-9(14(18)19)12(10)16-13;1-2-4-9-7-10-6-5-8(9)3-1;1-2-4-6-5-3-1;;/h1-7,15H;1-7H;1-5H;;/q-3;2*-1;+5;
charge 0 multiplicity 2
57 atoms
Co 0.09054871 -0.13968285 -0.49493401
O  0.16586228 -4.20675897 -0.02060382
C  0.61284252 -3.03754541 -0.12580733
O  -0.20132453 -2.01864499 -0.09058374
C  2.07819178 -2.80561766 -0.24252407
C  3.00634634 -3.85569324 -0.2449043
C  4.39036115 -3.61432664 -0.29002376
C  4.91648455 -2.31818021 -0.32438924
C  3.99596066 -1.27140228 -0.32390312
N  4.12753024 0.10872209 -0.35426228
C  2.88047338 0.6702921 -0.35078832
C  2.58119826 2.08081231 -0.3987519
C  3.59379494 3.04515972 -0.18743198
C  3.32193879 4.40270444 -0.25491327
C  2.01054564 4.82376726 -0.53921058
C  0.99710357 3.89870292 -0.74409999
C  1.2463884 2.50446233 -0.68208178
O  0.21652685 1.7019272 -0.93291537
N  1.95779407 -0.29805908 -0.30371334
C  2.60727702 -1.50838818 -0.29298028
H  2.64095977 -4.87618148 -0.20406629
H  5.07192007 -4.45851328 -0.29095424
H  5.9855306 -2.13837536 -0.3509964
H  5.00098263 0.61759412 -0.42249232
H  4.60259088 2.71779725 0.04728134
H  4.11063227 5.12726902 -0.08333125
H  1.78038079 5.88404104 -0.59251909
H  -0.0163721 4.22108585 -0.96278362
N  -1.87203889 0.01487236 -0.71452151
C  -2.36578355 0.73668782 -1.76897243
C  -3.71404658 0.87602764 -1.98973722
C  -4.64498072 0.25694898 -1.11390439
C  -6.05252097 0.34802601 -1.27116487
C  -6.88835215 -0.28598785 -0.37342413
C  -6.36263995 -1.03357343 0.71273507
C  -4.99961345 -1.14077398 0.89174875
C  -4.11769241 -0.49782942 -0.01819617
C  -2.71187983 -0.57707231 0.12610352
H  -1.62369855 1.18752143 -2.41477909
H  -4.06349427 1.4569576 -2.83692166
H  -6.45618375 0.91897954 -2.10178547
H  -7.96479921 -0.21486035 -0.4959568
H  -7.042978 -1.52164026 1.40326378
H  -4.5848789 -1.71011453 1.71829452
H  -2.27668574 -1.14183596 0.94349903
N  -0.09435313 0.34900396 1.455969
C  0.46354103 -0.41159502 2.41960935
C  0.35147007 -0.09517876 3.77077689
C  -0.36060125 1.04664218 4.14213234
C  -0.93759686 1.83226766 3.1426119
C  -0.78460465 1.45211675 1.81252227
H  1.00831968 -1.28831306 2.09202215
H  0.81797792 -0.73754645 4.50895545
H  -0.46361412 1.31821279 5.18757976
H  -1.50121207 2.72742904 3.37993135
H  -1.21210177 2.02964113 1.00176242
O  0.24251559 -0.5506655 -2.23272847
