program: Gaussian 09
title: /home/michael/molsimp_comfiles/Co_31a_10_OH/Co_31a_10_OH.com auto generated
version: ES64L-G09RevE.01
frameworkgroup: C1[X(C31H23CoN4O3)]
method: UTPSSh
basis: Gen
operation: Freq
keyword: #P
keyword: Geom=AllCheck
keyword: Guess=TCheck
keyword: SCRF=Check
keyword: GenChk
keyword: UTPSSh/ChkBas
keyword: Freq
title: /home/michael/molsimp_comfiles/Co_31a_10_OH/Co_31a_10_OH.com auto gene
converged: YES YES NO YES
polarizability: 7.72491337e+02 3.09960317e+01 5.37103794e+02 7.96378560e+01 5.61269684e+01 7.03021067e+02
1716.lowfreq: -6.5048 -2.5432 0.0005 0.0008 0.0009 10.3655 17.9343 22.9236 31.5503
frequency: 16.9211 22.7191 31.3339 34.7440 40.3848 44.2432 70.9082 80.6481 100.9836 119.6219 128.3202 136.6775 140.9371 163.1542 164.4494 184.3727 186.2712 190.4640 202.6677 204.3960 212.8279 243.7699 254.8465 269.3887 280.0548 293.2243 302.7851 309.7045 325.4926 350.3750 373.6526 380.4824 393.2040 397.9739 400.6100 415.4376 453.5162 477.0926 479.6517 482.3130 486.5791 494.9402 497.5907 510.3519 513.5993 524.1693 525.2739 537.4672 542.8285 546.7838 550.0747 566.6687 599.3935 615.9541 623.4706 642.5306 643.1810 649.0643 651.0093 652.7595 666.6977 689.2438 730.9219 740.7090 742.2381 755.7262 762.4461 765.2452 766.5343 777.0152 777.7277 787.2977 789.5321 832.1984 835.3904 842.2594 843.9426 848.1688 851.7346 861.4315 887.7475 891.7640 898.8828 913.0618 940.1953 946.8464 948.0550 951.3201 964.6720 966.3660 975.6177 982.1210 984.4423 987.3740 992.0599 1016.2267 1016.9069 1017.5149 1039.2163 1039.8520 1040.1600 1059.6279 1070.3271 1072.1033 1072.9011 1100.9185 1156.3089 1157.1880 1157.6319 1171.6671 1175.2342 1175.5329 1179.5519 1199.5863 1204.3418 1242.6396 1248.4467 1248.8019 1255.0052 1278.0068 1281.3649 1281.7342 1287.1503 1288.1520 1293.5036 1325.2598 1351.0219 1373.0119 1381.4658 1384.9282 1402.5093 1409.2456 1411.7025 1428.2182 1432.3933 1445.0011 1466.4006 1473.4166 1474.4305 1489.8182 1495.2583 1497.4794 1502.8661 1526.2075 1545.0452 1545.1289 1569.8342 1599.2399 1608.4292 1609.3194 1632.4123 1641.7446 1643.7029 1651.6343 1673.1160 1673.3846 1680.4118 3187.9692 3189.8732 3194.5600 3200.6085 3200.8982 3205.6601 3205.7866 3205.9200 3206.0448 3215.1991 3215.5130 3219.5973 3219.6322 3220.8423 3224.4459 3224.7672 3226.6208 3232.0754 3232.8787 3251.2943 3262.0512 3626.7003 3768.4716
redmass: 6.1690 6.1953 5.4159 5.6324 4.5785 4.4300 5.1100 5.9986 5.1818 5.4136 6.3044 6.4811 5.9444 6.0015 6.3415 4.8652 3.4294 2.9750 3.1027 1.8752 6.1172 5.4145 5.5018 6.0538 8.7048 7.1149 8.1744 6.4903 8.8113 7.0877 5.9788 4.6789 3.5260 3.2747 4.9444 8.1834 2.0439 2.7261 2.7599 1.9068 5.3031 4.2019 4.0831 7.7312 8.1924 6.8708 6.8080 3.4000 7.5638 4.3385 6.9214 8.0433 7.4472 4.8232 8.1953 6.5912 6.6459 3.5762 4.4643 4.9691 5.6544 4.9722 2.1175 5.9124 2.9104 2.9289 1.2447 1.4192 1.2552 3.6392 3.7758 4.6944 4.7292 6.1555 5.8965 1.3619 1.4302 4.2728 1.4910 1.4532 1.4025 1.4114 6.1146 1.1319 1.4962 1.3376 1.2438 1.4361 4.8119 4.9218 1.3159 1.3070 1.2612 1.3793 1.3738 1.3017 7.3509 1.2978 1.8831 2.3584 2.3575 2.1360 2.9532 2.8451 2.8727 3.6214 1.4987 1.4948 1.5803 1.1495 1.1160 1.1167 1.3267 1.3795 1.4073 2.5609 2.0993 2.0849 2.0104 2.8056 1.6286 1.6442 2.1684 1.8424 1.8289 2.8999 3.9384 3.0800 3.7269 3.5761 5.7213 1.7149 1.7541 7.3127 7.5153 3.1481 2.5197 2.4442 2.4253 3.8819 2.1062 2.1085 3.0149 3.6575 3.2129 3.2476 5.8852 7.7887 6.6714 6.6139 6.4271 5.2004 5.1011 5.9792 6.1392 6.0751 9.4332 1.0872 1.0856 1.0890 1.0865 1.0864 1.0890 1.0929 1.0936 1.0890 1.0951 1.0951 1.0910 1.0914 1.0974 1.0984 1.0984 1.0915 1.0941 1.0917 1.0947 1.0936 1.0821 1.0664
irintensity: 0.7374 4.1278 1.6718 2.5604 0.4746 1.1250 2.3897 3.0399 0.2252 1.1926 2.2242 1.0451 3.6979 3.0432 1.4064 25.3648 11.1929 16.6716 28.2109 78.6494 18.9046 11.3323 8.0232 53.9033 0.5233 0.8014 4.6673 1.0689 6.1235 67.1269 1.8021 16.4387 1.0118 1.3019 11.0250 37.2345 49.5509 18.5111 16.5932 131.4881 45.4276 26.9317 14.1631 177.0109 104.6023 2.2220 2.3535 0.1151 7.8635 12.1942 6.1815 22.5778 1.4922 7.7547 21.3311 10.7817 14.8169 8.3063 5.7962 21.8932 2.4370 1.5871 33.7569 21.8271 74.7447 15.9035 35.3853 93.5941 28.5603 3.2242 4.2572 0.6677 0.2864 6.0187 0.6211 83.2910 8.2796 58.4074 115.3092 5.2349 16.2634 18.3344 1.7176 123.1166 15.6729 4.9503 1.3778 9.0621 5.6299 1.3209 0.4049 2.9010 0.3063 7.4653 4.1143 0.0123 3.6061 0.0250 13.8388 9.8288 11.6090 33.4409 38.0620 92.5750 23.1192 50.9812 5.0296 1.5618 50.2949 11.8049 5.4887 5.1555 3.7729 28.0191 25.9414 105.1542 25.1859 14.4964 61.2733 510.6187 5.0841 14.7640 18.2402 12.4875 25.6973 131.9030 142.0795 10.9616 2.0380 0.9753 203.5516 44.8133 45.7763 33.4412 33.2157 34.2720 137.9826 4.7238 3.6105 10.6510 6.1560 6.2730 427.5740 21.1731 19.5526 9.2337 92.9354 89.2212 5.4422 4.2513 38.9406 19.6698 14.0156 296.4870 60.3970 62.4266 232.0977 14.3363 7.4365 7.2845 0.6864 0.5634 1.9707 51.6331 33.3048 0.3525 31.2694 30.4899 5.2052 5.6419 43.0402 31.5145 32.7941 2.6590 17.3946 0.9799 9.9097 15.9090 281.7152 27.4288
temp: 298.150 k
press: 1.00000 atm
elementType: 27 8 6 6 6 6 6 6 6 7 6 6 6 6 6 8 6 7 1 1 1 1 1 1 1 1 7 6 6 6 6 6 6 6 6 6 1 1 1 1 1 1 1 7 6 6 6 6 6 6 6 6 6 1 1 1 1 1 1 1 8 1
symmnumber: 1
zpe: 1248544.5 jmol-1
zpe.correction: 0.475546 hartree
zpe.thermalcorrener: 0.506809 hartree
zpe.thermalcorrenthalpy: 0.507753 hartree
zpe.thermalcorrgfe: 0.413090 hartree
zpe.sumelectzpe: -1784.674174 hartree
zpe.sumelectthermal: -1784.642910 hartree
zpe.sumelectthermalent: -1784.641966 hartree
zpe.sumelectthermalfe: -1784.736630 hartree
dipole: 1.7516 9.2114 -5.7878
dipole: 11.0189
quadrupole: -133.4470 -211.2601 -215.2906
quadrupole: -1.8325 -0.5203 -5.3488
quadrupole: 53.2189 -24.5942 -28.6247 -1.8325 -0.5203 -5.3488
hfenergy: -1785.1497192 hartree
pointgroup: C01 [X(C31H23Co1N4O3)]
dipole: -1.074478 -0.7269309 4.1365279 debye
polarizability: 723.9496064|-86.2152463|768.5405853|2.5253638|-10.0177514|520.1260059 unknown
InChI: InChI=1S/C13H8N2O2.2C9H7N.Co.H2O/c16-10-6-2-1-4-8(10)13-14-9-5-3-7-11(17)12(9)15-13;2*1-2-4-9-7-10-6-5-8(9)3-1;;/h1-7,14H;2*1-7H;;1H2/q-3;2*-1;+6;/p-1
charge 0 multiplicity 1
62 atoms
Co -0.16744643 -0.15726795 0.60283432
O  -0.08940788 -2.07762981 0.5109558
C  1.00058431 -2.85287166 0.42504971
C  0.76364496 -4.23348462 0.20663736
C  1.80010862 -5.15567081 0.1342776
C  3.13771931 -4.74818683 0.27011899
C  3.41027091 -3.40356902 0.4791024
C  2.37670136 -2.4468834 0.56056694
C  2.65197672 -1.04361308 0.76243134
N  3.84169798 -0.34623563 0.89148125
C  3.55404721 1.0256496 0.99980006
C  4.2386025 2.24934693 1.10197879
C  3.42007724 3.39333925 1.11291229
C  2.00105276 3.40250008 1.01684454
C  1.31706499 2.17737979 0.91740519
O  0.01110515 1.88345558 0.77522071
C  2.16746535 1.07363769 0.94576433
N  1.65675 -0.17527417 0.81559243
H  -0.26872495 -4.55418207 0.10095302
H  1.56538976 -6.20325792 -0.03243724
H  3.94604438 -5.46928253 0.21032515
H  4.4397269 -3.07118978 0.58350759
H  4.76214213 -0.76999786 0.88828148
H  5.31790552 2.32864675 1.15843188
H  3.91413045 4.35835994 1.18998138
H  1.47256313 4.35105979 1.00928688
N  -2.10669733 -0.10542616 0.33402642
C  -2.90508189 -1.06681633 0.89920436
C  -4.26855806 -1.07030568 0.7384904
C  -4.89462629 -0.05144295 -0.02798948
C  -6.29613597 0.0214168 -0.23939434
C  -6.82577071 1.04605325 -0.99840888
C  -5.98833878 2.03587629 -1.57602266
C  -4.62285548 1.99204878 -1.38858916
C  -4.05210142 0.94836286 -0.61150423
C  -2.65628608 0.86104323 -0.39167904
H  -2.38934452 -1.82561101 1.47453907
H  -4.8639601 -1.8512831 1.19977446
H  -6.93752906 -0.73558015 0.20155154
H  -7.89816965 1.09980139 -1.15923694
H  -6.43149809 2.8297973 -2.16865479
H  -3.97166023 2.74308221 -1.82590517
H  -1.98207182 1.59480155 -0.82008806
N  -0.45415749 -0.21298068 2.57578855
C  0.13986753 -1.17245053 3.35460175
C  -0.03291892 -1.22353619 4.71644862
C  -0.8538845 -0.26425369 5.36509849
C  -1.08558488 -0.24460632 6.76516493
C  -1.90007568 0.72544781 7.314426
C  -2.51528354 1.71133741 6.49885428
C  -2.30820682 1.71875846 5.13563282
C  -1.47341425 0.73178824 4.54507239
C  -1.22904787 0.70044366 3.1515705
H  0.75881179 -1.89078778 2.83436628
H  0.46205205 -1.99864147 5.29217099
H  -0.61580535 -0.99793646 7.39018646
H  -2.07597829 0.73925231 8.38569731
H  -3.15098591 2.46206492 6.95735844
H  -2.77195255 2.46806385 4.50089968
H  -1.67331757 1.44581045 2.50081659
O  0.02979579 -0.02046272 -1.27298401
H  0.94715055 -0.28242583 -1.45568978
