program: Gaussian 09
title: /home/michael/molsimp_comfiles/Co_31a_10_OH/Co_31a_10_OH.com auto generated
version: ES64L-G09RevE.01
frameworkgroup: C1[X(C31H22CoN4O3)]
method: UTPSSh
basis: Gen
operation: Freq
keyword: #P
keyword: Geom=AllCheck
keyword: Guess=TCheck
keyword: SCRF=Check
keyword: GenChk
keyword: UTPSSh/ChkBas
keyword: Freq
title: /home/michael/molsimp_comfiles/Co_31a_10_OH/Co_31a_10_OH.com auto gene
converged: YES YES NO YES
polarizability: 7.82325002e+02 2.78378300e+01 5.41647342e+02 8.23091852e+01 5.87200002e+01 7.04335780e+02
1716.lowfreq: -8.8536 0.0004 0.0005 0.0008 4.9448 5.1461 16.8986 19.8337 28.0667
frequency: 16.7861 19.6845 27.7329 30.5794 36.7995 41.2144 66.7382 74.2136 97.0235 118.5315 126.0229 134.4361 136.7110 157.5263 162.5801 181.7697 185.3775 188.5132 200.9868 206.8174 230.1630 248.9546 265.1404 271.3907 287.4852 301.4133 306.0655 333.6701 349.0087 362.0194 378.3849 390.2782 393.9414 398.2176 412.1297 442.1971 472.9145 476.2937 477.0832 485.8566 495.0586 495.9740 510.7880 522.0777 524.1958 530.3168 534.8496 541.4531 544.0540 554.4402 566.7775 598.4082 613.6482 621.5115 642.2385 642.5630 647.6657 648.8813 651.4712 666.4062 687.4487 729.6480 740.3936 741.7336 754.8745 760.9867 764.9812 765.6845 776.3016 777.5217 786.2310 789.0663 829.6739 833.9512 842.1386 844.4386 847.4566 848.4076 860.2305 886.4274 891.2854 898.9117 940.5265 941.5063 945.9639 948.5214 963.1833 964.4747 974.6498 981.0991 984.8308 986.6058 990.9182 1015.1783 1015.2157 1018.2731 1039.1223 1039.7535 1039.8993 1059.2604 1068.9617 1070.8896 1072.0215 1101.5928 1156.2817 1156.7017 1158.3470 1171.8100 1174.9392 1175.4378 1179.7429 1196.0608 1196.9558 1241.0955 1245.5681 1247.3894 1253.8601 1276.4935 1278.4775 1279.8616 1286.3181 1286.6409 1291.8733 1324.8095 1350.7218 1373.1219 1380.9662 1382.8012 1402.1126 1406.8178 1406.8991 1428.4686 1431.9832 1444.6643 1466.4376 1473.1517 1473.3140 1489.7506 1493.9290 1494.2118 1502.6584 1526.1425 1543.4382 1544.3094 1570.4622 1600.7302 1607.4762 1609.2985 1632.3773 1641.0837 1642.5302 1651.6934 1672.2715 1672.8917 1680.5285 3189.1338 3190.7326 3194.9511 3199.8858 3201.7777 3204.5373 3206.7000 3207.0439 3207.3851 3214.3642 3216.4270 3218.8834 3220.3163 3220.9525 3221.4511 3224.0679 3225.4010 3230.7349 3232.5979 3250.6600 3254.3531 3621.7918
redmass: 6.0924 6.1762 5.5170 6.0522 4.5468 4.3002 5.1769 6.1548 5.3493 5.3213 6.4999 6.6723 6.8027 6.1200 7.0933 7.7331 3.6383 3.9766 6.4446 6.9736 6.9853 5.7628 7.4648 9.0005 7.9108 8.5714 6.3789 8.6642 7.0275 7.0136 4.7083 4.1943 3.2284 4.1304 8.6530 1.6163 2.2630 2.6811 2.6656 6.3946 3.7901 4.1498 7.2486 6.9746 6.8365 9.9032 3.7305 8.1575 4.0468 8.5122 7.7444 7.5151 4.9213 8.0781 6.6593 6.7129 3.5996 3.5442 6.4244 5.7547 4.9991 2.1542 6.0701 2.8232 2.9070 1.2453 1.4080 1.2682 3.6323 3.6433 4.6533 4.7050 6.1432 5.9783 1.3616 1.4336 5.0428 1.4179 1.4581 1.4080 1.3958 6.3305 1.4897 1.4954 1.3387 1.2442 4.7560 5.0097 1.3192 1.3086 1.2630 1.3835 1.3709 1.8881 2.7333 1.3000 1.8822 2.3549 2.3523 2.1450 2.6266 3.0135 2.9999 3.5474 1.5006 1.4894 1.5894 1.1547 1.1168 1.1156 1.3301 1.3609 1.3750 2.6467 2.0926 2.0832 1.9446 2.6516 1.6572 1.6346 1.8722 2.1275 1.8319 2.8547 3.9927 3.1183 3.5689 3.3424 5.5453 1.8671 1.8052 7.1305 7.4741 3.1484 2.5118 2.4443 2.4416 3.8769 2.1335 2.1519 3.0584 3.6716 3.2542 3.2836 5.8113 7.9508 6.7244 6.6312 6.4246 5.2314 5.1808 6.0349 6.1118 6.1482 9.4557 1.0873 1.0857 1.0891 1.0866 1.0865 1.0890 1.0937 1.0890 1.0928 1.0951 1.0952 1.0913 1.0912 1.0910 1.0975 1.0983 1.0984 1.0921 1.0941 1.0953 1.0943 1.0822
irintensity: 0.6995 4.5554 2.5062 3.2873 1.7756 0.0606 1.6064 3.7169 0.9451 1.7911 2.0049 1.5993 12.6818 1.6350 2.1595 8.3652 1.8765 2.0951 4.3684 3.5057 6.7659 3.8104 19.7131 0.8007 5.0875 9.9676 1.5037 3.4428 60.3287 16.0220 13.2436 4.7905 0.5949 9.2306 35.7107 103.6612 62.9015 7.7341 43.6111 66.6772 14.0303 2.5984 74.4106 2.3529 0.9373 55.3969 3.2333 3.5992 2.0992 11.7292 23.3294 1.8931 3.9343 22.5053 11.6318 14.9469 6.2348 11.7622 16.5090 2.6757 1.2527 31.2776 15.2989 73.7210 21.7247 34.9087 100.4419 20.2838 3.5674 3.9975 0.3874 0.3468 7.4787 3.1817 83.6785 9.1144 70.1707 110.3086 4.6051 15.0144 17.3395 2.9124 11.5246 12.3881 4.6747 1.2862 4.7639 1.0043 0.4209 1.9455 0.2976 7.1380 3.6617 0.7577 1.5929 0.0195 13.2763 9.7031 11.8899 35.0831 49.6239 108.6265 6.1755 50.8966 5.0234 2.3497 48.2296 10.8592 5.2512 5.6842 3.9820 22.3093 47.4876 118.2043 19.9384 14.6073 59.0765 485.4179 36.0015 12.8368 7.0282 8.1672 25.3400 114.8398 137.1265 12.0953 0.9633 0.9306 186.5731 21.7387 72.2741 38.3852 34.7435 36.0969 128.1035 7.1011 4.4224 10.4512 8.0846 8.5524 418.2682 19.8195 14.7691 14.4915 87.1349 93.3375 3.7277 4.5305 35.2446 25.4455 18.5230 296.8821 65.4739 70.9056 228.2842 14.2010 7.7898 6.3543 1.1308 0.4205 0.8265 42.0148 1.4214 39.2570 31.0013 29.1583 6.4119 1.2020 5.4270 43.2931 33.0778 31.7839 0.9970 16.3982 8.2985 16.3034 287.3066
temp: 298.150 k
press: 1.00000 atm
elementType: 27 8 6 6 6 6 6 6 6 7 6 6 6 6 6 8 6 7 1 1 1 1 1 1 1 1 7 6 6 6 6 6 6 6 6 6 1 1 1 1 1 1 1 7 6 6 6 6 6 6 6 6 6 1 1 1 1 1 1 1 8
symmnumber: 1
zpe: 1217772.9 jmol-1
zpe.correction: 0.463825 hartree
zpe.thermalcorrener: 0.494709 hartree
zpe.thermalcorrenthalpy: 0.495654 hartree
zpe.thermalcorrgfe: 0.400311 hartree
zpe.sumelectzpe: -1784.015351 hartree
zpe.sumelectthermal: -1783.984467 hartree
zpe.sumelectthermalent: -1783.983523 hartree
zpe.sumelectthermalfe: -1784.078866 hartree
dipole: 4.0073 9.5298 -6.1541
dipole: 12.0311
quadrupole: -131.5960 -212.2734 -212.8174
quadrupole: -9.0088 1.7943 -3.4581
quadrupole: 53.9663 -26.7112 -27.2551 -9.0088 1.7943 -3.4581
hfenergy: -1784.4791764 hartree
pointgroup: C01 [X(C31H22Co1N4O3)]
dipole: -1.8851224 -0.5020639 4.3127051 debye
polarizability: 731.2807656|-89.0733994|773.9363098|4.7226544|-10.3138292|523.0910482 unknown
InChI: InChI=1S/C13H8N2O2.2C9H7N.Co.O/c16-10-6-2-1-4-8(10)13-14-9-5-3-7-11(17)12(9)15-13;2*1-2-4-9-7-10-6-5-8(9)3-1;;/h1-7,14H;2*1-7H;;/q-3;2*-1;+5;
charge 0 multiplicity 2
61 atoms
Co -0.12952516 -0.17774178 0.61366798
O  -0.05696779 -2.09856538 0.58302634
C  1.03354191 -2.87023997 0.46570583
C  0.79573238 -4.2443112 0.21398886
C  1.83218803 -5.16603369 0.13141106
C  3.16889108 -4.76220119 0.28386551
C  3.44189516 -3.42187813 0.5185314
C  2.40826392 -2.46689359 0.61334575
C  2.68323115 -1.066489 0.83051978
N  3.87159914 -0.37095967 0.97361624
C  3.58625367 1.00227068 1.07018118
C  4.27269824 2.22525358 1.16525009
C  3.4577589 3.37163537 1.14590833
C  2.04076428 3.38371489 1.02397398
C  1.35468863 2.15919622 0.93531827
O  0.05034295 1.86676211 0.77116051
C  2.20047949 1.05381126 0.99973031
N  1.69100766 -0.19504962 0.87104333
H  -0.23617696 -4.56173401 0.09560772
H  1.59791955 -6.20973462 -0.05834056
H  3.97705332 -5.4825344 0.21395683
H  4.47132975 -3.09203381 0.63041493
H  4.7907732 -0.79730238 0.98956231
H  5.35131587 2.30206538 1.23595453
H  3.95351226 4.33622467 1.21648042
H  1.51573299 4.33347818 0.98904718
N  -2.07227614 -0.12552165 0.34713925
C  -2.86776427 -1.09328588 0.90486066
C  -4.23196771 -1.08984577 0.75023874
C  -4.85920931 -0.06058505 -0.00121034
C  -6.26111825 0.01682903 -0.20688902
C  -6.79128251 1.05152555 -0.95189113
C  -5.95449457 2.04744045 -1.51994696
C  -4.58856201 1.99985347 -1.33754997
C  -4.01751403 0.94557523 -0.57527418
C  -2.62149198 0.85330304 -0.36382319
H  -2.3506258 -1.85878583 1.46951722
H  -4.82699037 -1.87383963 1.20667177
H  -6.9022033 -0.74434688 0.22703886
H  -7.86404985 1.10875802 -1.10875887
H  -6.39858821 2.84924674 -2.1010647
H  -3.9375128 2.75509566 -1.7675627
H  -1.94674698 1.59087694 -0.78451705
N  -0.43879172 -0.20424485 2.62159417
C  0.13768065 -1.16037726 3.41696419
C  -0.06077197 -1.20505361 4.77569673
C  -0.89353751 -0.24173228 5.40314644
C  -1.15612783 -0.21772463 6.79770518
C  -1.98147162 0.75472368 7.32607903
C  -2.57688349 1.73959575 6.49466693
C  -2.33915174 1.74334347 5.13642781
C  -1.49347572 0.75316917 4.56708321
C  -1.22017823 0.71461952 3.17889564
H  0.76465625 -1.88299841 2.91178898
H  0.42100243 -1.9781419 5.36525062
H  -0.70184188 -0.97021611 7.43509373
H  -2.18145585 0.77128533 8.39311413
H  -3.22163905 2.49225801 6.93710623
H  -2.78723698 2.49166479 4.48938437
H  -1.64943273 1.45909992 2.51647975
O  0.09432244 -0.08679194 -1.14297065
