program: Gaussian 09
title: 000032019
version: EM64L-G09RevD.01
frameworkgroup: C1[X(C16H17NO5)]
method: RPBEPBE
basis: SDD
operation: Freq
keyword: #p
keyword: freq=noraman
keyword: PBEPBE/SDD
title: #p freq=noraman PBEPBE/SDD
converged: YES YES NO NO
title: Mulliken charges:
elementType: O O O O O N C C C C C C C C C C C C C C C C H H H H H H H H H H H H H H H H H
charge: -0.232525 -0.252830 -0.230235 -0.288139 -0.263566 -0.290352 -0.066970 -0.443392 -0.280925 0.254791 0.436018 -0.335375 -0.355640 -0.343667 -0.374619 0.239111 -0.328662 0.180982 -0.220409 0.192141 -0.674274 -0.446470 0.272236 0.253836 0.244803 0.198931 0.214655 0.303138 0.244465 0.271719 0.270035 0.229865 0.213518 0.228726 0.228912 0.211844 0.230339 0.230218 0.277765
chargesum: 0.00000
title: Mulliken charges with hydrogens summed into heavy atoms:
elementType: O O O O O N C C C C C C C C C C C C C C C C
charge: -0.232525 -0.252830 -0.230235 -0.288139 -0.263566 -0.290352 0.205267 0.055248 0.132661 0.254791 0.436018 -0.032237 -0.111175 -0.071948 -0.104585 0.239111 0.114721 0.180982 0.237228 0.192141 -0.001873 -0.168705
polarizability: 3.50087077e+02 1.12713274e+01 1.77220832e+02 -1.20277247e+01 -1.20437443e+00 1.08076578e+02
1716.lowfreq: -5.5479 -2.5272 -0.0006 -0.0002 0.0008 7.1484 11.9599 22.8996 34.1756
frequency: 11.6989 22.8919 34.1042 48.1857 55.5413 60.1622 70.2380 80.1944 100.4244 105.6346 112.0756 132.9692 159.9560 195.2598 202.5838 216.6169 243.3961 247.9564 286.8801 315.4362 319.2774 333.9293 353.5559 367.6668 415.0001 441.9450 456.6851 501.3538 517.3490 535.8984 570.0064 630.2617 637.7543 657.5479 674.8315 678.3041 680.4658 682.6119 737.7557 756.5029 796.6985 799.2034 831.2146 846.7167 850.6351 872.5500 901.6555 929.4146 938.7296 970.7213 981.9284 989.4747 1003.8182 1004.4081 1023.9708 1044.5024 1049.1382 1065.5294 1073.1863 1084.9998 1112.6776 1126.2317 1129.5162 1136.2762 1174.4024 1192.7702 1194.3116 1202.3005 1220.5139 1248.8138 1257.0758 1288.2912 1315.8234 1317.2119 1319.8818 1346.8576 1360.6672 1365.8429 1386.9498 1401.3695 1409.1601 1429.7822 1454.7431 1462.9250 1468.2800 1474.1552 1486.7376 1490.8342 1509.3679 1569.3333 1613.6516 1622.3271 1698.5853 2157.1953 2908.6820 2922.8945 2967.4218 2968.0663 2978.5246 2995.7388 3009.2336 3042.4827 3061.9413 3067.0642 3092.2206 3107.0812 3148.8871 3168.2527 3171.3010 3195.1579 3426.6089
redmass: 5.7111 5.4432 3.5733 3.4107 3.5621 3.4328 4.3542 4.6033 4.7267 5.4531 3.4701 3.7527 3.9333 5.3736 5.0460 2.8772 6.2195 1.3836 4.7754 3.7527 3.6781 5.9402 3.7690 7.7425 2.9756 4.5021 3.5247 6.0335 3.1240 6.3605 5.2514 7.0288 1.2304 4.9730 6.8960 4.7086 6.7479 1.2968 6.3235 4.5155 4.9022 1.1269 1.4616 3.8871 4.1487 1.4998 7.2653 7.0416 1.7946 3.0500 1.3720 1.6751 3.3453 1.3504 2.3058 4.6826 2.9073 5.8680 3.3673 3.3186 2.2108 1.9026 1.6964 1.4703 3.4081 1.1364 1.2051 1.0803 1.1571 1.1318 2.9494 1.4160 1.4119 1.2830 1.5446 1.5418 1.4294 2.4054 3.7188 1.2722 1.5573 3.6096 1.0931 1.0405 1.0754 1.0611 1.0731 1.1175 2.5748 7.7933 10.7980 6.2156 11.9351 6.0058 1.0596 1.0559 1.0836 1.0839 1.1001 1.0358 1.0582 1.0903 1.0955 1.1066 1.0985 1.1025 1.0876 1.0952 1.0912 1.0956 1.1610
irintensity: 0.3167 0.1682 4.4074 1.9466 1.1610 2.6619 1.8455 1.0814 3.0162 8.5493 3.1652 2.0384 1.4091 2.4341 4.5856 0.8822 2.2966 1.8014 5.8854 2.8049 3.5278 0.2401 10.2884 13.5170 0.0944 4.7946 1.5472 6.3987 10.8339 4.7162 2.9783 0.9030 73.2252 11.2990 16.5250 21.1135 0.9974 64.2837 5.8381 16.0418 5.4628 2.1344 16.4119 11.7089 8.9724 49.6446 35.8774 188.0659 4.3358 3.9403 2.2444 4.6735 14.4851 0.5692 25.5572 314.5065 234.0714 484.4981 51.1087 23.1867 2.9117 39.7708 13.9205 5.6535 228.6510 111.9107 60.9850 7.3416 14.7611 0.1747 357.2868 2.6265 72.7564 32.3188 168.3615 12.5073 5.7575 140.5545 69.4470 20.1976 1.8208 23.6721 7.0793 12.1784 5.0560 5.0617 24.9168 59.8600 128.8460 13.6559 284.7398 177.8708 357.0712 2.5425 50.1694 61.8721 26.4409 55.9506 20.8268 22.6732 23.9783 5.3303 28.5666 8.9932 33.5277 44.9303 5.6445 14.2530 1.9933 3.0277 64.6794
temp: 298.150 k
press: 1.00000 atm
elementType: 8 8 8 8 8 7 6 6 6 6 6 6 6 6 6 6 6 6 6 6 6 6 1 1 1 1 1 1 1 1 1 1 1 1 1 1 1 1 1
symmnumber: 1
zpe: 788852.4 jmol-1
zpe.correction: 0.300458 hartree
zpe.thermalcorrener: 0.322453 hartree
zpe.thermalcorrenthalpy: 0.323397 hartree
zpe.thermalcorrgfe: 0.245535 hartree
zpe.sumelectzpe: -1049.083733 hartree
zpe.sumelectthermal: -1049.061738 hartree
zpe.sumelectthermalent: -1049.060794 hartree
zpe.sumelectthermalfe: -1049.138656 hartree
dipole: 1.5458 -3.8932 0.9041
dipole: 4.2853
quadrupole: -104.0335 -138.9243 -126.3241
quadrupole: -26.8959 5.8660 -2.1443
quadrupole: 19.0605 -15.8303 -3.2301 -26.8959 5.8660 -2.1443
hfenergy: -1049.3841915 hartree
pointgroup: C01 [X(C16H17N1O5)]
dipole: 0.5666425 -1.5360529 0.4024977 debye
polarizability: 350.5406041|6.1590283|176.615355|-12.5718534|-2.9972526|108.2285275 unknown
InChI: InChI=1S/C16H17NO5/c1-3-9-20-11-14-10-17(16(19)22-14)13-7-5-12(6-8-13)15(18)21-4-2/h1,5-8,14H,4,9-11H2,2H3
charge 0 multiplicity 1
39 atoms
O  2.794986 1.201605 0.018687
O  5.416071 -0.377519 -0.049869
O  0.935497 2.593046 0.223968
O  -5.724133 0.467189 0.121679
O  -5.465552 -1.8503 0.17372
N  0.724079 0.217582 -0.031987
C  3.034151 -0.23683 -0.303558
C  1.661931 -0.921505 -0.066881
C  4.155905 -0.785918 0.568471
C  1.403875 1.450943 0.081039
C  -0.684976 0.032012 0.017354
C  -1.58724 1.135109 0.008906
C  -1.207621 -1.292847 0.06804
C  -2.972793 0.905088 0.046737
C  -2.595084 -1.50722 0.104758
C  -3.495699 -0.413424 0.093423
C  6.57099 -0.66858 0.824707
C  -4.954325 -0.700837 0.133402
C  -7.20384 0.268773 0.160209
C  7.812608 -0.313575 0.130576
C  -7.835397 1.656875 0.149095
C  8.878611 -0.027795 -0.41587
H  3.341788 -0.278986 -1.363201
H  1.419339 -1.619074 -0.886372
H  1.63477 -1.479746 0.891185
H  4.088692 -1.898387 0.609882
H  4.05335 -0.384377 1.60024
H  -1.195923 2.153418 -0.016979
H  -0.54019 -2.159033 0.084635
H  -3.664979 1.75145 0.039632
H  -3.003641 -2.522293 0.144396
H  6.481722 -0.084046 1.766398
H  6.584132 -1.7495 1.090799
H  -7.495658 -0.337978 -0.716292
H  -7.453813 -0.30485 1.071222
H  -8.936643 1.566023 0.176571
H  -7.513682 2.244135 1.026167
H  -7.555701 2.210934 -0.763294
H  9.801993 0.229841 -0.902494
