program: Gaussian 09
title: /home/michael/molsimp_comfiles/Cr_oct_desorbed_5_OH/Cr_oct_desorbed_5_OH.com auto generated
version: ES64L-G09RevE.01
frameworkgroup: C1[X(C26H18CrN4O5)]
method: UTPSSh
basis: Gen
operation: Freq
keyword: #P
keyword: Geom=AllCheck
keyword: Guess=TCheck
keyword: SCRF=Check
keyword: GenChk
keyword: UTPSSh/ChkBas
keyword: Freq
title: /home/michael/molsimp_comfiles/Cr_oct_desorbed_5_OH/Cr_oct_desorbed_5_
converged: YES YES NO NO
polarizability: 5.79739872e+02 -3.60304766e+01 5.43724980e+02 -4.36006407e+01 2.55553273e+01 5.96936021e+02
1716.lowfreq: -7.3838 -4.3030 0.0008 0.0009 0.0010 10.9797 19.7047 23.8961 27.4083
frequency: 18.9334 23.7758 27.0181 29.5323 33.7734 44.2109 53.5592 56.4719 80.5848 83.9105 108.5303 123.6033 126.0734 141.0050 150.7364 154.1622 160.7560 178.6831 182.9368 188.5429 208.2788 218.3453 235.7174 252.6674 253.1724 285.1806 295.9856 309.2811 319.1006 353.5992 359.2261 362.5281 383.1247 389.5550 394.4875 428.5105 439.3251 443.4529 445.5540 474.8613 489.5026 509.4831 525.3582 530.7262 538.7151 573.9152 638.0796 642.0416 647.5028 651.7241 652.5198 661.9816 678.0435 692.6052 698.0826 742.4658 751.8207 758.1929 764.6585 768.8367 774.8638 777.4122 782.7584 789.7305 827.2065 830.9403 833.2272 845.0820 847.6374 876.0673 883.8290 890.4153 917.8395 934.3192 943.4375 946.6006 964.7050 964.8117 979.4618 991.0345 996.8914 1015.8409 1019.2587 1025.1254 1027.9967 1031.1726 1035.1064 1040.1548 1045.0761 1047.9831 1068.0619 1089.9327 1102.6876 1104.2177 1127.7833 1132.1185 1157.7325 1170.5909 1176.7378 1179.6001 1181.6108 1205.0951 1206.5363 1220.4764 1232.8354 1252.0024 1283.7117 1294.8545 1298.4517 1302.8345 1326.4944 1351.4222 1376.6078 1382.8277 1385.2836 1391.2291 1417.6337 1423.2413 1432.6708 1455.7659 1474.0905 1479.2250 1495.4268 1498.6717 1517.6042 1521.8999 1546.2970 1551.1909 1599.6656 1607.5437 1621.3692 1621.8142 1637.2139 1641.1044 1642.2341 1645.0940 1654.8668 1672.5665 3201.7016 3206.4644 3216.0864 3220.4429 3220.6919 3223.0157 3226.8316 3226.8827 3231.1189 3232.3811 3237.4207 3239.9708 3244.9521 3245.6968 3248.8387 3251.7852 3252.5454 3259.7717
redmass: 5.1049 5.0165 6.1736 5.2664 5.0920 6.3289 7.8069 6.1397 10.8708 7.9032 8.1185 6.0527 7.1263 7.1313 7.1547 7.3793 5.2480 7.2909 3.7611 7.3777 6.6652 9.8858 8.3052 5.6375 7.8547 6.0936 10.9200 10.6606 15.5167 9.1981 9.4056 7.9261 4.9250 2.6561 3.1414 8.9805 4.0752 4.2122 4.1007 2.8831 3.4205 9.0058 6.7781 5.3292 7.8456 7.1148 6.7927 6.5109 3.7147 7.2374 6.3582 6.2716 8.6097 8.6841 1.6960 3.3890 2.3859 10.2287 1.2363 1.8061 2.1652 3.6506 9.8460 4.7205 2.0451 6.5658 9.4706 1.4353 2.2934 17.1702 1.2585 1.3969 6.5768 1.4027 1.4916 1.4019 4.3519 1.3792 1.3146 1.3737 1.4324 7.5956 1.3018 1.3497 1.3345 1.3210 6.9102 2.3709 7.2399 6.3863 2.5693 1.6936 1.7335 1.8194 2.1730 2.2782 1.4938 1.0760 1.1135 1.4999 2.1968 1.4272 1.4996 1.9651 1.2206 2.1989 1.6601 1.8287 3.2191 11.1546 7.8591 2.8922 3.7076 1.4606 3.1898 5.9302 1.6897 3.7423 7.1294 2.8141 2.5376 2.2757 2.8847 2.0095 3.0819 1.9543 3.1633 12.9846 6.6463 6.2980 6.1631 6.2106 9.1694 5.5959 5.1606 7.2929 5.2540 6.0204 1.0868 1.0893 1.0952 1.0914 1.0883 1.0921 1.0979 1.0892 1.0898 1.0896 1.0946 1.0949 1.0939 1.0967 1.0975 1.0957 1.0963 1.0938
irintensity: 2.1384 1.4327 10.5020 9.2725 9.4699 5.0917 3.5773 5.0551 0.3608 2.6823 18.7382 7.1201 8.5389 3.5765 4.7208 6.8732 3.4443 4.4468 1.7694 5.4691 2.6243 8.0257 11.9585 2.8543 2.6293 13.3325 11.7807 47.7532 178.7013 61.4165 37.2950 14.6259 15.0048 0.1707 2.1827 19.7113 8.3477 45.3423 16.1236 11.5049 29.5858 22.6246 0.0693 5.0412 16.3160 8.6249 27.9054 11.6939 5.6290 30.2130 1.3867 16.5055 70.2646 61.2173 91.0123 6.0678 1.7399 41.4575 35.7229 34.9690 94.3091 2.1675 48.2333 0.7003 80.9988 6.3580 68.4380 78.6080 10.3258 363.0050 0.7992 8.8782 19.1489 0.4518 8.6195 0.0557 9.9863 1.1623 0.5283 4.9850 0.2035 26.7243 0.0182 0.0434 0.3188 0.1445 35.7569 11.0826 37.5863 5.5343 82.2570 42.0276 3.2272 41.1701 4.8285 11.9755 2.5083 2.8779 5.6487 40.9824 180.7375 46.7196 116.9661 47.9835 24.7680 10.4756 1.8725 16.6292 390.5280 44.8512 1.6882 6.2537 0.8870 15.9173 86.5276 539.9006 34.3216 121.0972 43.4506 0.8799 7.4171 77.2248 99.2374 17.4003 59.9091 3.2689 19.1968 1317.9082 47.5616 5.6010 42.6101 23.6221 1111.6794 176.8009 132.8204 116.1742 58.8549 98.5286 1.5247 1.0161 27.8615 3.9850 3.9371 0.2406 29.7939 3.9818 3.9097 0.5553 1.0418 1.1209 0.2768 9.1021 0.2294 0.3635 11.5713 14.0921
temp: 298.150 k
press: 1.00000 atm
elementType: 24 8 6 8 6 6 6 6 6 6 6 6 6 6 6 8 8 7 7 1 1 1 1 1 1 8 7 6 6 6 6 6 6 6 6 6 1 1 1 1 1 1 1 7 6 6 6 6 6 1 1 1 1 1
symmnumber: 1
zpe: 1040550.9 jmol-1
zpe.correction: 0.396325 hartree
zpe.thermalcorrener: 0.426497 hartree
zpe.thermalcorrenthalpy: 0.427441 hartree
zpe.thermalcorrgfe: 0.331681 hartree
zpe.sumelectzpe: -1682.947569 hartree
zpe.sumelectthermal: -1682.917397 hartree
zpe.sumelectthermalent: -1682.916453 hartree
zpe.sumelectthermalfe: -1683.012213 hartree
dipole: -3.0213 -6.9637 22.5992
dipole: 23.8400
quadrupole: -125.8868 -254.3958 -178.6819
quadrupole: 13.9175 -17.5970 45.0386
quadrupole: 60.4347 -68.0743 7.6396 13.9175 -17.5970 45.0386
hfenergy: -1683.3438939 hartree
pointgroup: C01 [X(C26H18Cr1N4O5)]
dipole: 9.2838076 -1.0977498 0.7607358 debye
polarizability: 576.3577694|-50.3416626|597.7252874|-10.3469626|35.7960818|546.3178167 unknown
InChI: InChI=1S/C12H6N2O4.C9H7N.C5H5N.Cr.O/c15-11(16)9-5-1-3-7(13-9)8-4-2-6-10(14-8)12(17)18;1-2-4-9-7-10-6-5-8(9)3-1;1-2-4-6-5-3-1;;/h1-6H;1-7H;1-5H;;/q-3;2*-1;+5;
charge 0 multiplicity 3
54 atoms
Cr 0.06440763 -0.09301553 0.21823304
O  2.19473202 3.35729648 0.28015216
C  1.83197644 2.17318341 0.27399926
O  0.57619069 1.79695982 0.20228684
C  2.79708659 1.02660856 0.34437484
C  4.18372465 1.09374596 0.4363667
C  4.8869302 -0.11636806 0.49254869
C  4.20838314 -1.33672832 0.45080916
C  2.81004856 -1.31862989 0.35400169
C  1.89108953 -2.46919478 0.2924864
C  2.32561677 -3.78917206 0.27850954
C  1.38104614 -4.81561306 0.21862545
C  0.03383606 -4.48662281 0.18112951
C  -0.3590401 -3.13896357 0.19893399
C  -1.85791606 -2.8584634 0.18223464
O  -2.41501916 -2.79738899 1.31545985
O  -2.40647457 -2.81332422 -0.9557204
N  0.55314803 -2.13996726 0.24575512
N  2.15812975 -0.14876692 0.308507
H  4.69040274 2.05098221 0.4653558
H  5.96865399 -0.1100103 0.56863626
H  4.75568917 -2.27047478 0.49527835
H  3.38482586 -4.01176406 0.31195974
H  1.6982684 -5.85250848 0.20389658
H  -0.73138288 -5.25325554 0.13952198
O  -1.57402005 -0.09526993 0.15136057
N  0.04553113 0.00837974 2.32337005
C  0.73897578 -0.81788932 3.17115313
C  0.72200204 -0.65530401 4.53452326
C  -0.02660296 0.40163319 5.11485806
C  -0.09297277 0.64521037 6.51105889
C  -0.84392195 1.70052677 6.98957809
C  -1.55762667 2.55240176 6.10597599
C  -1.51462254 2.33967851 4.74465916
C  -0.74836666 1.26083065 4.22616833
C  -0.67099291 1.0053108 2.83840098
H  1.30274075 -1.61888722 2.71225727
H  1.28320843 -1.33806911 5.16364797
H  0.45156298 -0.00492206 7.18884736
H  -0.89264723 1.88634171 8.05812819
H  -2.13903229 3.37432237 6.51117194
H  -2.05550352 2.98276062 4.05692228
H  -1.20885941 1.63552016 2.13806476
N  0.19292302 -0.02047776 -1.88931413
C  1.04268256 -0.7372061 -2.65366699
C  1.11334321 -0.57903768 -4.03446756
C  0.28272163 0.35733578 -4.65171426
C  -0.59527141 1.10065826 -3.86046179
C  -0.61426149 0.88363794 -2.48708473
H  1.6759624 -1.45561706 -2.14826908
H  1.8106053 -1.18236673 -4.60422056
H  0.31814782 0.50413433 -5.72608325
H  -1.26050939 1.83931692 -4.29260595
H  -1.28287338 1.43277268 -1.83526117
