program: Gaussian 09
title: 000032306
version: EM64L-G09RevD.01
frameworkgroup: C1[X(C17H22I3NO4)]
method: RPBEPBE
basis: SDD
operation: Freq
keyword: #p
keyword: freq=noraman
keyword: PBEPBE/SDD
title: #p freq=noraman PBEPBE/SDD
converged: NO YES NO NO
title: Mulliken charges:
elementType: I I I O O O O N C C C C C C C C C C C C C C C C C H H H H H H H H H H H H H H H H H H H H H H
charge: 0.159192 0.152202 0.176137 -0.285332 -0.393470 -0.213313 -0.260222 -0.246524 -0.402184 -0.360119 -0.091396 -0.350790 0.637004 0.659613 -0.628982 -0.345113 -0.694938 0.183996 -0.550409 0.208696 -0.587459 -0.114875 -0.464721 -0.665505 -0.677080 0.218223 0.243234 0.221808 0.190126 0.245128 0.205498 0.193915 0.225232 0.260901 0.214433 0.219941 0.210520 0.277825 0.242931 0.235290 0.219989 0.259054 0.216321 0.235088 0.230450 0.207064 0.382623
chargesum: 0.00000
title: Mulliken charges with hydrogens summed into heavy atoms:
elementType: I I I O O O O N C C C C C C C C C C C C C C C C C
charge: 0.159192 0.152202 0.176137 -0.285332 -0.010846 -0.213313 -0.260222 -0.246524 0.059273 0.051814 0.153732 0.048624 0.637004 0.659613 -0.628982 0.141020 -0.050045 0.183996 -0.550409 0.208696 -0.587459 0.162950 0.013500 0.029860 -0.004478
polarizability: 3.56302739e+02 -1.53411620e+01 2.95640918e+02 1.77314222e+01 1.99521762e+01 2.07713737e+02
1716.lowfreq: -15.9812 -8.9900 -5.2122 0.0003 0.0004 0.0005 3.3933 16.5616 19.2578
frequency: -15.0711 15.9806 19.0557 25.2943 30.6721 31.9155 43.7694 47.2377 61.6041 70.0776 77.8009 81.6996 85.0870 92.9794 94.9706 112.0017 115.6006 123.1065 132.3076 141.8307 163.1477 183.7896 196.9293 201.9072 219.6712 229.8700 237.0900 243.7266 251.5419 269.0350 285.0989 329.1389 332.0138 363.6322 382.0125 422.9300 440.7873 468.8558 485.8219 510.6694 525.2497 533.6441 561.4492 582.9324 599.6959 633.7345 649.0167 678.3875 700.7712 723.0693 732.7234 750.1491 764.8526 772.6405 802.2735 820.9018 836.5983 875.3630 875.7471 890.4946 909.9144 949.5615 996.0347 1011.8327 1019.4658 1025.3819 1045.3796 1052.0313 1065.2499 1075.5613 1079.8930 1087.8501 1104.5353 1110.7933 1143.6044 1149.6828 1194.0252 1211.5042 1235.2317 1241.1888 1248.9952 1255.4976 1257.4326 1279.4759 1285.2940 1294.6271 1297.5398 1312.1608 1330.3477 1337.2178 1355.2516 1358.6520 1368.8687 1373.2551 1386.3352 1391.5679 1394.9362 1400.8420 1438.8565 1448.3745 1451.4403 1466.5752 1467.6155 1468.3907 1476.3926 1479.0150 1479.4433 1483.3229 1487.7902 1500.8361 1526.7399 1604.5891 1666.3581 2962.4569 2970.7766 2975.3135 2976.7971 2991.1020 2991.4546 2997.9383 3009.4544 3010.8305 3026.5281 3027.6983 3034.8132 3066.4837 3070.9782 3073.1951 3076.0788 3086.4886 3093.9565 3104.8680 3114.1312 3182.7644 3509.7712
redmass: 5.5758 5.8993 5.3906 6.0580 2.8632 6.7425 4.3931 4.4555 2.3204 3.5449 3.6125 15.4429 4.2099 4.2108 13.6234 3.2622 3.1037 3.0773 4.5187 5.5535 96.4974 2.2710 1.5411 2.2135 5.1960 3.6140 1.3740 1.8066 2.3633 4.2181 5.0728 4.2054 5.1651 4.3148 4.8509 6.0912 4.3805 7.8641 4.1433 4.1744 3.6303 3.5730 3.1864 3.6979 4.4072 1.8588 4.0133 7.6894 4.8358 3.9799 1.2399 4.0410 1.5160 1.7407 1.3784 5.0178 1.7757 2.6453 1.5051 2.6594 2.4986 1.3552 2.6467 4.1619 3.8913 2.6097 3.1090 2.6456 1.6225 2.3716 1.6124 2.1171 2.7631 2.0169 2.0057 2.3816 2.0312 1.4762 3.6496 2.4022 1.4421 1.4279 1.1774 1.2693 1.6768 1.1284 2.7015 2.1821 1.6140 1.5767 1.5559 1.6254 1.7490 1.9593 1.2232 1.2138 1.2232 3.2427 1.1076 1.0989 1.0907 1.0687 1.0470 1.0405 1.0657 1.0437 1.0542 1.0528 1.0815 10.5050 8.6221 7.5182 9.0069 1.0599 1.0611 1.0363 1.0596 1.0620 1.0368 1.0365 1.0955 1.0594 1.0986 1.0872 1.0997 1.1016 1.1038 1.1009 1.0995 1.0976 1.1000 1.1002 1.1025 1.0929 1.0640
irintensity: 0.2370 0.2184 0.5132 0.0908 0.2142 1.4293 0.2662 0.6801 0.1647 0.2306 0.2194 0.1087 0.5263 0.1679 0.1980 1.8519 1.1670 0.7067 0.1011 0.8714 0.0037 0.5658 0.8974 1.2626 1.0322 0.8136 0.8279 0.4424 1.2780 6.3098 2.4257 10.9814 4.7032 1.1453 2.3145 3.1366 9.1495 14.3005 3.5370 28.8882 8.7633 13.3541 14.0661 9.8517 23.2020 62.1968 8.5391 31.4583 97.0819 39.4322 5.1485 12.7671 3.6943 1.8946 11.3422 17.7871 0.1109 13.0210 16.3643 10.6184 24.5126 10.6553 18.6110 29.4674 55.7168 1.7145 230.2997 53.3989 22.5515 0.4176 0.7004 8.9209 11.2103 25.4146 30.8342 15.3195 68.7052 2.8934 133.1449 55.8384 10.7104 9.7317 1.0425 13.7155 28.3894 6.5124 7.2197 19.0902 18.7931 37.9390 1.2826 55.4688 38.4089 42.9117 43.5247 13.1866 46.9139 208.1161 33.5942 10.3166 3.8579 1.6642 9.3776 9.9952 3.8836 13.5629 10.5649 13.1555 16.5129 6.8708 2.6588 235.2070 164.0468 3.5261 46.1722 37.0300 28.3598 23.7339 28.8644 29.8257 4.7389 18.5859 2.6968 21.9953 25.9915 1.1294 2.8252 81.4819 44.4591 32.5429 24.9789 23.1485 20.3548 0.2808 33.0560
temp: 298.150 k
press: 1.00000 atm
elementType: 53 53 53 8 8 8 8 7 6 6 6 6 6 6 6 6 6 6 6 6 6 6 6 6 6 1 1 1 1 1 1 1 1 1 1 1 1 1 1 1 1 1 1 1 1 1 1
symmnumber: 1
zpe: 941263.6 jmol-1
zpe.correction: 0.358508 hartree
zpe.thermalcorrener: 0.387900 hartree
zpe.thermalcorrenthalpy: 0.388845 hartree
zpe.thermalcorrgfe: 0.291319 hartree
zpe.sumelectzpe: -1049.255122 hartree
zpe.sumelectthermal: -1049.225730 hartree
zpe.sumelectthermalent: -1049.224786 hartree
zpe.sumelectthermalfe: -1049.322311 hartree
dipole: -2.3852 0.4703 0.4218
dipole: 2.4675
quadrupole: -197.7664 -194.7227 -186.6127
quadrupole: 18.6990 0.3646 2.1797
quadrupole: -4.7324 -1.6888 6.4212 18.6990 0.3646 2.1797
hfenergy: -1049.6136303 hartree
pointgroup: C01 [X(C17H22I3N1O4)]
dipole: 0.9383889 0.1878281 0.1630102 debye
polarizability: 330.9721358|11.2593492|299.2681385|60.8502359|-0.5665725|229.4171197 unknown
InChI: InChI=1S/C17H22I3NO4/c1-4-7-8-12(17(23)24)25-16-11(19)9-10(18)15(14(16)20)21(6-3)13(22)5-2/h9,12,23H,4-8H2,1-3H3
charge 0 multiplicity 1
47 atoms
I  -0.473589 -2.079612 1.431207
I  -3.40473 2.789805 -1.048898
I  1.827055 3.604499 1.953125
O  1.508427 0.404889 2.249521
O  3.738075 -0.882148 3.686933
O  4.728163 0.790867 2.415412
O  -3.718698 -1.814355 -1.662582
N  -2.7800 -0.372506 -0.108774
C  2.974648 0.108959 0.172671
C  4.052619 -0.780042 -0.493717
C  2.664421 -0.337348 1.604038
C  4.301696 -0.381766 -1.96708
C  -1.730639 0.514597 0.297963
C  0.450748 0.86916 1.465667
C  -0.59402 0.019019 1.008328
C  -3.78788 -0.818768 0.906641
C  5.385335 -1.247979 -2.643208
C  3.820483 -0.050734 2.571528
C  -1.782441 1.916294 0.052051
C  -2.809037 -0.981543 -1.380248
C  0.330809 2.265677 1.222311
C  -0.772527 2.785338 0.517113
C  -1.695012 -0.594653 -2.360798
C  -5.175811 -0.169466 0.747042
C  -1.790796 -1.375898 -3.682901
H  2.045755 0.052882 -0.427746
H  3.312927 1.161247 0.179817
H  5.003631 -0.697677 0.068039
H  3.741425 -1.845006 -0.452247
H  2.423569 -1.41533 1.64583
H  4.599115 0.685367 -2.00832
H  3.35154 -0.464771 -2.533403
H  -3.367941 -0.603553 1.905281
H  -3.884232 -1.914075 0.800509
H  6.352572 -1.156769 -2.114454
H  5.545255 -0.944052 -3.693673
H  5.100039 -2.316919 -2.640767
H  -0.844118 3.858641 0.331177
H  -1.750935 0.495033 -2.554091
H  -0.71349 -0.770684 -1.876581
H  -5.147016 0.91849 0.925645
H  -5.571016 -0.356637 -0.264667
H  -5.872029 -0.622438 1.477604
H  -2.761343 -1.19672 -4.175223
H  -1.711567 -2.46192 -3.506361
H  -0.982438 -1.067772 -4.370169
H  4.459501 -0.650619 4.333754
