program: Gaussian 09
title: /home/michael/molsimp_comfiles/Cr_3a1_25_OH/Cr_3a1_25_OH.com auto generated
version: ES64L-G09RevE.01
frameworkgroup: C1[X(C23H16CrN5O5)]
method: UTPSSh
basis: Gen
operation: Freq
keyword: #P
keyword: Geom=AllCheck
keyword: Guess=TCheck
keyword: SCRF=Check
keyword: GenChk
keyword: UTPSSh/ChkBas
keyword: Freq
title: /home/michael/molsimp_comfiles/Cr_3a1_25_OH/Cr_3a1_25_OH.com auto gene
converged: YES YES NO YES
polarizability: 5.90682309e+02 5.03560434e+00 5.83633341e+02 3.15773937e+00 5.36120312e+01 4.11129562e+02
1716.lowfreq: -7.5030 -0.0004 0.0006 0.0010 6.5022 13.1957 22.6502 30.0331 31.6419
frequency: 16.6710 25.1440 30.5740 34.4426 41.4729 57.5761 82.8995 85.7196 103.1990 110.5228 119.0203 124.2240 147.4668 170.0037 171.6914 177.8317 179.0881 186.5731 201.5896 221.7880 232.7692 249.1305 260.1187 284.6796 289.7780 311.3952 315.4615 385.1354 389.9276 392.4645 394.4100 401.4734 417.2809 423.0585 448.2710 477.0430 477.3123 478.2989 490.4625 492.4555 526.7813 533.1383 533.8141 538.2833 539.5316 561.9907 588.6228 638.5286 641.1073 662.5485 664.4905 681.0914 691.9391 722.8628 764.4876 766.9288 772.7748 784.1808 785.5625 794.1627 797.2841 801.9252 805.1879 840.9324 844.7051 857.2085 860.3434 861.7034 865.7824 892.9336 894.6851 915.8263 964.8359 976.7971 977.6033 988.1053 989.3713 999.4155 1000.2195 1023.8652 1024.2985 1032.8035 1034.0453 1034.1271 1048.5993 1096.3146 1096.8905 1100.2261 1156.2162 1156.8606 1170.9055 1171.4139 1172.0291 1180.2859 1180.8415 1186.0220 1200.3307 1244.7387 1247.0790 1280.2050 1284.7323 1285.3338 1310.6538 1311.1705 1335.7933 1339.4716 1344.5867 1392.8708 1439.9361 1440.8769 1447.6986 1453.2503 1453.6745 1482.5102 1484.9934 1505.6218 1538.6156 1540.2555 1585.3002 1586.2472 1612.9990 1621.9905 1622.4139 1623.2382 1627.9971 1642.7635 1661.2367 1662.8003 3209.9291 3210.8117 3216.1934 3217.9969 3225.2139 3226.1773 3229.5042 3231.0965 3232.1191 3232.2716 3233.6100 3245.6416 3250.7650 3267.7722 3280.1108 3644.8692
redmass: 5.1963 6.9020 5.2680 5.2979 6.2804 8.0818 7.1494 11.0794 6.5259 7.5731 8.4225 7.8316 6.8752 6.2245 5.2500 4.5816 5.6970 6.1494 8.4293 7.8491 8.4650 7.5033 8.1249 8.3885 14.1302 12.9202 11.6299 3.0540 3.6424 5.5704 5.9020 5.9323 1.1602 11.0932 3.9870 3.1535 5.2869 3.2342 3.6325 3.7377 12.1944 7.0879 7.0382 8.0769 8.1454 13.7181 7.3484 7.3126 7.2300 4.5131 4.4748 7.6496 7.7663 11.2665 1.3194 1.3162 1.8333 5.5598 5.5587 3.6456 3.6982 7.6775 12.7964 5.1060 5.3498 1.8822 1.3525 1.5014 1.2061 1.5250 1.5193 8.2861 1.3939 5.1023 5.3635 1.3235 1.3313 1.3616 1.3632 1.3203 1.3159 2.3068 2.2709 1.3575 5.8126 1.8528 2.9885 3.1448 1.4930 1.5136 1.2272 1.2342 1.2543 3.5836 1.3346 1.5354 2.6687 3.0316 2.9751 3.7480 1.8075 1.8209 2.6592 2.6764 3.0376 3.1003 9.0778 5.0792 6.0271 5.5390 3.4980 2.1065 2.0739 2.3765 2.3812 3.0258 3.1731 3.1088 6.7266 6.7066 11.7558 5.9243 7.7578 6.1661 8.9706 8.1939 5.6953 5.7250 1.0872 1.0873 1.0895 1.0895 1.0955 1.0956 1.0902 1.0926 1.0940 1.0977 1.0987 1.0939 1.0965 1.0952 1.0944 1.0660
irintensity: 0.4551 8.1488 7.3628 3.9231 3.3847 8.9163 6.4566 18.0853 1.6948 2.5441 5.2836 0.9745 5.8367 0.7904 5.7973 12.3339 3.4483 2.2933 4.1350 2.2998 25.6802 18.1834 28.5041 42.6508 147.0288 135.6652 22.8610 14.5423 4.5434 8.9725 7.6961 1.8768 202.9492 48.8192 19.9020 3.7956 0.1591 7.8202 0.6751 8.2401 209.6738 4.7490 1.6091 4.9997 34.8032 226.7681 9.3412 7.7803 6.5828 0.4856 2.0000 55.9080 75.1527 187.4081 51.3360 59.9057 64.2794 21.3197 22.9867 7.4807 5.9270 2.8620 18.2045 18.2318 9.8506 56.8608 41.6496 51.7818 304.0721 9.3982 7.0309 71.5411 0.0192 1.4451 1.6735 0.8757 0.7438 3.2808 3.9277 0.0056 0.0104 7.1452 7.2611 0.6489 44.3181 91.0939 43.8446 22.5604 6.0631 10.0371 10.1629 13.4720 15.4572 178.1673 5.7180 20.8549 23.8844 16.4664 9.0996 18.7630 0.6010 0.9045 6.3972 28.2298 11.3188 4.7744 1165.1083 22.5545 73.9490 76.7498 26.8120 5.8584 23.7719 20.3716 14.9026 30.4773 15.9386 17.2200 21.8819 6.7284 1734.7702 57.4632 322.0924 28.0736 666.2185 95.4200 5.5144 6.7176 0.0670 0.1444 3.8959 3.7152 15.1823 14.5799 2.8557 0.8530 7.5720 13.6349 17.7471 0.2864 0.4956 5.5069 6.3148 322.5933
temp: 298.150 k
press: 1.00000 atm
elementType: 24 8 6 8 6 6 6 6 6 6 8 8 7 1 1 1 8 1 7 6 6 6 6 6 6 6 6 7 1 1 1 1 1 1 7 6 6 6 6 6 6 6 6 7 1 1 1 1 1 1
symmnumber: 1
zpe: 944196.5 jmol-1
zpe.correction: 0.359625 hartree
zpe.thermalcorrener: 0.387945 hartree
zpe.thermalcorrenthalpy: 0.388889 hartree
zpe.thermalcorrgfe: 0.297979 hartree
zpe.sumelectzpe: -1622.193987 hartree
zpe.sumelectthermal: -1622.165667 hartree
zpe.sumelectthermalent: -1622.164723 hartree
zpe.sumelectthermalfe: -1622.255633 hartree
dipole: -1.3639 5.7946 -3.6437
dipole: 6.9796
quadrupole: -48.2769 -168.7858 -247.4057
quadrupole: 3.0806 8.1307 -23.1286
quadrupole: 106.5459 -13.9630 -92.5829 3.0806 8.1307 -23.1286
hfenergy: -1622.553612 hartree
pointgroup: C01 [X(C23H16Cr1N5O5)]
dipole: 2.4814494 1.0029696 0.6138953 debye
polarizability: 559.911725|-80.2492256|435.0912778|-6.0218907|0.2965283|590.4422085 unknown
InChI: InChI=1S/2C8H6N2.C7H3NO4.Cr.H2O/c2*1-2-4-8-7(3-1)5-6-9-10-8;9-6(10)4-2-1-3-5(8-4)7(11)12;;/h2*1-6H;1-3H;;1H2/q2*-1;-3;+6;/p-1
charge 0 multiplicity 4
50 atoms
Cr 0.19381615 -0.54384909 0.02006068
O  3.23296806 -3.29174798 0.07063336
C  2.50335522 -2.28683625 0.03732899
O  1.19593791 -2.31461785 0.0769109
C  3.08276149 -0.89430702 -0.05449081
C  4.42547406 -0.52691152 -0.12553275
C  4.73095975 0.83907235 -0.18239194
C  3.71187609 1.79971677 -0.15798639
C  2.39284093 1.35421584 -0.08429779
C  1.13281034 2.18436114 -0.02911903
O  0.03650311 1.48268188 0.03938833
O  1.17894484 3.42760615 -0.04600766
N  2.1254708 0.04324559 -0.04342438
H  5.20247157 -1.28211203 -0.13368247
H  5.76647839 1.15609836 -0.24077742
H  3.93238812 2.86008257 -0.19365071
O  -1.59876352 -1.15145806 0.03647603
H  -1.95636959 -0.91842894 0.91569622
N  0.14128042 -0.43759021 2.1485154
C  1.23322008 -0.4525913 2.95988873
C  1.12983934 -0.28468852 4.3255874
C  -0.14535882 -0.09138292 4.88509667
C  -0.40024447 0.10001339 6.26877914
C  -1.69572001 0.27728805 6.7017527
C  -2.78527133 0.26992069 5.78489446
C  -2.57448116 0.08675906 4.43806547
C  -1.24570714 -0.09573267 3.96446763
N  -1.06774846 -0.26627661 2.62819367
H  2.18662157 -0.60498375 2.47359793
H  2.01924912 -0.30116571 4.94595157
H  0.43319213 0.10369069 6.96354422
H  -1.89726859 0.425059 7.75776663
H  -3.79317055 0.41164251 6.16055036
H  -3.39139312 0.07880198 3.72447464
N  0.09614061 -0.56021039 -2.10082828
C  0.77173845 -1.4413428 -2.89015009
C  0.62158969 -1.45501995 -4.26068638
C  -0.26409214 -0.53319906 -4.84700481
C  -0.52549725 -0.43847777 -6.23935275
C  -1.42447432 0.49848102 -6.69947871
C  -2.0954791 1.37595739 -5.80121918
C  -1.86294379 1.3124981 -4.44682182
C  -0.94028238 0.35306953 -3.9447701
N  -0.74059652 0.31583207 -2.59966629
H  1.42137419 -2.1345711 -2.37485365
H  1.17273981 -2.1678473 -4.86436038
H  -0.0126248 -1.11059229 -6.91973727
H  -1.62991481 0.5740501 -7.76239866
H  -2.79827257 2.10171315 -6.19695026
H  -2.36440882 1.97250871 -3.74702315
