program: Gaussian 09
title: 000031907
version: EM64L-G09RevD.01
frameworkgroup: C1[X(C13H10N2O3)]
method: RPBEPBE
basis: SDD
operation: Freq
keyword: #p
keyword: freq=noraman
keyword: PBEPBE/SDD
title: #p freq=noraman PBEPBE/SDD
converged: YES YES NO NO
title: Mulliken charges:
elementType: O O O N N C C C C C C C C C C C C C H H H H H H H H H H
charge: -0.248672 -0.266071 -0.232169 -0.393015 -0.392840 0.051393 0.468534 -0.204618 0.150597 0.150160 -0.285749 -0.222999 0.151088 -0.370796 -0.377904 -0.233819 -0.234449 -0.226742 0.263600 0.228267 0.302052 0.366719 0.364765 0.245598 0.236183 0.236647 0.236252 0.237985
chargesum: 0.00000
title: Mulliken charges with hydrogens summed into heavy atoms:
elementType: O O O N N C C C C C C C C C C C C C
charge: -0.248672 -0.266071 -0.232169 -0.026296 -0.028075 0.051393 0.468534 0.058982 0.150597 0.150160 -0.057482 0.079053 0.151088 -0.125197 -0.141721 0.002829 0.001803 0.011243
polarizability: 4.50226104e+02 -2.31080439e+00 1.66046064e+02 -1.84630318e-03 -2.79875792e-03 6.26340813e+01
1716.lowfreq: -6.1053 -0.0006 0.0007 0.0010 2.9743 7.0457 31.8144 38.3867 46.8760
frequency: 31.8043 38.3706 46.8636 69.6069 148.1990 156.0793 161.0779 165.6064 200.4243 245.4278 294.5178 345.2670 361.2238 391.1524 398.5907 407.2528 444.7124 494.2113 513.5441 522.6089 590.1530 612.7743 620.3716 636.8117 658.1779 683.9057 690.6448 737.3373 756.4534 773.3897 790.8403 791.9923 848.1040 865.2623 906.9740 941.8606 975.5824 985.1767 987.3518 993.4430 1003.6003 1023.5571 1033.0845 1046.0459 1085.8016 1176.2546 1189.8360 1195.1399 1197.2454 1242.4198 1271.0680 1292.8144 1301.1046 1332.5452 1359.1510 1363.2242 1372.6090 1386.7387 1398.4506 1442.0498 1481.8836 1563.7039 1575.6320 1594.9782 1602.2499 1609.3745 1640.7871 1671.6757 3081.1669 3090.3024 3125.8917 3135.4759 3146.6396 3157.2074 3162.6172 3171.6830 3533.0262 3537.0507
redmass: 7.2899 4.7558 6.4944 6.5914 5.2480 6.0331 6.7653 10.9743 7.2312 2.0628 5.1534 5.4624 12.6603 13.6937 2.8813 3.3693 7.3272 9.5463 2.8228 5.0985 7.5716 6.4936 7.9961 2.4102 4.8885 2.2819 1.6952 1.8561 2.2702 1.7361 5.6419 4.0720 1.2734 4.3812 1.4778 1.6137 1.5499 1.3993 6.1410 3.4667 1.3418 2.2639 1.1322 4.4268 1.6544 1.0871 1.7130 2.3480 1.7145 2.5869 1.5110 2.3481 1.8718 1.4153 1.9943 1.7265 2.7208 5.5279 3.9490 2.3434 2.2558 7.0183 5.1862 6.0884 5.3222 6.1038 6.3942 5.5534 1.0900 1.0895 1.0877 1.0868 1.0915 1.0958 1.0916 1.1013 1.0767 1.0777
irintensity: 0.2979 0.0584 0.1486 0.4387 2.4423 0.1014 0.3637 7.5089 1.7708 0.8739 0.5741 4.3512 24.3782 13.9945 1.2101 2.7665 73.2758 20.3104 6.4854 13.8331 1.6905 0.2436 0.8485 0.0872 1.2211 39.3941 48.2703 0.2071 113.8010 33.4842 25.5708 151.7055 0.0279 1.1773 0.0015 1.0167 3.7671 0.0010 5.4570 1.1134 1.9795 3.7361 69.7548 0.0788 7.5900 7.8176 216.5482 18.4056 26.0813 72.1554 13.2538 88.9405 150.0461 187.4015 113.0514 12.0408 354.8986 77.6271 132.0317 28.2526 10.3168 732.7684 191.0398 441.4942 92.0584 0.4950 479.6895 600.2465 12.4051 0.3885 4.7724 0.9891 8.7407 35.0360 1.7718 39.2444 83.6230 97.2910
temp: 298.150 k
press: 1.00000 atm
elementType: 8 8 8 7 7 6 6 6 6 6 6 6 6 6 6 6 6 6 1 1 1 1 1 1 1 1 1 1
symmnumber: 1
zpe: 543566.6 jmol-1
zpe.correction: 0.207034 hartree
zpe.thermalcorrener: 0.221960 hartree
zpe.thermalcorrenthalpy: 0.222904 hartree
zpe.thermalcorrgfe: 0.163204 hartree
zpe.sumelectzpe: -835.348346 hartree
zpe.sumelectthermal: -835.333420 hartree
zpe.sumelectthermalent: -835.332475 hartree
zpe.sumelectthermalfe: -835.392176 hartree
dipole: -6.1769 0.2154 0.0029
dipole: 6.1806
quadrupole: -97.8185 -104.7143 -107.4516
quadrupole: 0.0392 -0.0129 -0.0020
quadrupole: 5.5096 -1.3862 -4.1235 0.0392 -0.0129 -0.0020
hfenergy: -835.5553794 hartree
pointgroup: C01 [X(C13H10N2O3)]
dipole: -2.4293332 0.1054907 -0.0094605 debye
polarizability: 450.1636759|-4.7363034|165.6073153|0.8453893|-7.1789392|63.1352574 unknown
InChI: InChI=1S/C13H10N2O3/c16-11-10(12(17)15-13(18)14-11)8-4-7-9-5-2-1-3-6-9/h1-8,14-15H
charge 0 multiplicity 1
28 atoms
O  2.906407 2.557079 -0.171746
O  1.261358 -2.020752 0.142779
O  5.813243 -1.072533 0.08719
N  4.316777 0.722446 -0.041107
N  3.510205 -1.484755 0.110892
C  1.886661 0.344417 -0.019342
C  -3.190726 0.354509 -0.026266
C  0.607919 0.894943 -0.05948
C  3.026817 1.300328 -0.08384
C  2.143774 -1.111478 0.08223
C  -1.840318 0.910193 -0.06308
C  -0.649657 0.204667 -0.013219
C  4.631989 -0.641757 0.054668
C  -3.450526 -1.047487 0.071369
C  -4.302031 1.248548 -0.089913
C  -4.771903 -1.528128 0.10363
C  -5.624395 0.764726 -0.057447
C  -5.864396 -0.626435 0.039454
H  0.586889 1.993447 -0.135377
H  -1.778542 2.007619 -0.13879
H  -0.624449 -0.886236 0.061409
H  5.112177 1.366402 -0.084441
H  3.707008 -2.487823 0.181053
H  -2.617357 -1.756099 0.122126
H  -4.116092 2.327073 -0.164899
H  -4.957801 -2.604829 0.178823
H  -6.465186 1.464592 -0.107088
H  -6.891443 -1.006576 0.064714
