program: Gaussian 09
title: /home/michael/molsimp_comfiles/Cr_3a1_21_OH/Cr_3a1_21_OH.com auto generated
version: ES64L-G09RevE.01
frameworkgroup: C1[X(C24H19CrN5O3)]
method: UTPSSh
basis: Gen
operation: Freq
keyword: #P
keyword: Geom=AllCheck
keyword: Guess=TCheck
keyword: SCRF=Check
keyword: GenChk
keyword: UTPSSh/ChkBas
keyword: Freq
title: /home/michael/molsimp_comfiles/Cr_3a1_21_OH/Cr_3a1_21_OH.com auto gene
converged: YES YES NO YES
polarizability: 5.28011930e+02 4.29725451e+01 5.11443949e+02 4.14514851e+01 2.40389489e+01 5.20653366e+02
1716.lowfreq: -12.9304 -11.6435 -0.0007 -0.0006 -0.0003 12.2145 20.2990 27.6721 29.6784
frequency: 13.2728 27.2029 29.3730 39.4366 44.8501 55.3656 61.6244 77.1891 99.0195 105.2836 112.4312 134.5474 145.5780 156.5095 161.2246 177.3788 185.9563 188.7070 202.6185 209.8543 235.1273 263.5291 277.4671 296.0491 299.1562 322.7943 356.1619 384.4380 391.3830 393.7109 394.5091 422.5903 438.8321 447.1992 449.0600 463.7587 479.5278 490.1193 495.6334 532.1566 536.6211 548.1057 573.1450 576.7676 641.3444 644.3736 646.1704 653.2288 660.8169 663.5012 693.5336 699.7607 728.2616 759.9986 763.0347 768.5903 771.2738 776.7956 787.0471 792.8425 804.4078 841.7078 851.4303 859.8433 880.4240 886.1190 890.4837 892.2872 920.3724 952.5845 967.4139 976.9389 987.4837 998.6082 999.9120 1001.3010 1022.5807 1029.4295 1029.7941 1031.4561 1033.0727 1033.5454 1036.8724 1048.3634 1050.4894 1066.1311 1092.5816 1095.0088 1103.6066 1105.1221 1108.1847 1140.8113 1157.1382 1171.5016 1172.5421 1178.7540 1187.3249 1188.9473 1209.8367 1236.6145 1247.7378 1285.0996 1295.8985 1310.8470 1318.6327 1321.2875 1326.7674 1341.1541 1359.6097 1382.4517 1388.5200 1440.3738 1442.8401 1454.4645 1481.2014 1483.5701 1484.9720 1489.5698 1523.9337 1527.1286 1540.1269 1586.5140 1608.6964 1616.3966 1620.8412 1621.0541 1621.9383 1641.1283 1649.1709 1655.0442 1662.2067 3210.8212 3217.5603 3220.7587 3225.9469 3227.2017 3229.7143 3231.9228 3232.9793 3234.0942 3234.5661 3238.5508 3244.7750 3248.5801 3249.7951 3249.8750 3252.9368 3253.5026 3270.7773 3608.5903
redmass: 5.9993 5.4145 4.7946 5.4691 4.3114 5.9740 6.8749 6.4939 4.3695 6.5770 7.4313 6.8649 6.3522 5.6135 5.4730 4.1134 8.2772 6.0950 6.3918 6.2594 6.3138 5.2378 8.0594 15.6620 8.9059 15.1108 8.9428 3.2789 2.8045 4.6494 7.2582 3.5682 3.9632 4.0260 1.1907 4.1728 2.7003 3.3723 8.5880 7.0636 8.3188 12.4514 6.9883 4.3221 7.2302 6.7734 7.0922 6.3853 4.4961 7.1371 7.9680 1.7257 5.5596 1.8814 1.3273 1.7771 8.6841 1.7316 5.5523 3.6057 2.3703 5.5366 2.5171 1.3256 7.5441 1.2501 1.1055 1.5218 1.3362 1.4045 1.3087 5.3938 1.3232 1.4240 1.3629 1.3844 1.3219 7.1577 1.3602 1.3259 2.2959 1.3361 6.5235 6.7682 6.6718 3.1141 1.7466 2.9414 2.1119 2.0355 1.5888 1.7486 1.4715 1.2073 1.0762 1.1695 1.6626 1.4917 1.6240 1.2236 3.0938 1.7874 3.2125 2.6129 2.0150 4.3109 8.3353 3.0618 3.2119 4.8284 1.2267 2.7635 5.1886 2.0947 2.2622 2.3410 2.3307 2.5919 1.9256 3.2116 3.0830 6.6722 5.9142 7.1428 5.9888 5.3720 8.9278 5.9069 6.2022 5.1594 5.7250 1.0873 1.0895 1.0887 1.0957 1.0893 1.0904 1.0928 1.0988 1.0900 1.0920 1.0949 1.0947 1.0962 1.0945 1.0966 1.0977 1.0959 1.0951 1.0661
irintensity: 3.4336 1.8066 4.5401 4.2968 2.9746 0.3485 10.5615 1.6694 3.2409 4.5572 5.0616 2.5052 3.8372 4.9060 4.1780 4.7519 1.3518 1.3928 2.8811 2.5741 2.3975 0.3941 12.9170 131.8516 3.3075 104.3726 0.6424 2.1521 2.6977 11.6513 51.3190 10.8951 16.1284 22.7390 201.4709 4.1253 3.0811 7.0292 46.1287 4.4149 46.1154 292.6981 40.1477 5.1595 7.5950 14.5492 26.9883 3.9351 0.3380 30.0787 66.6276 97.1707 55.8547 2.6149 57.2450 32.4421 63.0643 111.5737 28.0629 9.8599 31.4971 14.3706 6.9361 72.9080 49.1996 0.1679 286.7570 8.7456 0.1211 0.0145 1.4830 2.8936 1.1202 0.0324 3.4610 1.2166 0.0047 34.6295 0.4382 0.1999 7.4768 0.0848 25.7984 46.6777 9.1950 8.0253 68.9487 16.5580 7.6346 21.7074 33.4678 13.2294 10.5065 11.1491 3.4593 29.3890 41.3683 18.3487 88.1330 23.9233 12.8044 1.3054 216.5194 13.5877 56.3942 76.0531 4.8627 18.6130 118.1063 124.7442 4.0647 11.8306 64.9606 13.7454 72.3314 18.5504 7.8351 253.0449 4.0732 20.7676 15.7992 13.8882 40.3470 489.4124 79.0997 45.2900 892.3503 82.8609 15.6011 57.6960 5.8151 0.2616 3.2483 3.8823 13.6562 6.3711 3.4046 1.2882 17.3487 1.0465 1.6185 1.1580 0.8122 3.6769 5.6463 2.5838 6.9003 1.1858 4.5184 434.0132
temp: 298.150 k
press: 1.00000 atm
elementType: 24 8 6 8 6 6 6 6 6 6 6 6 6 6 7 7 1 1 1 1 1 1 1 8 1 7 6 6 6 6 6 6 6 6 7 1 1 1 1 1 1 7 6 6 6 6 6 1 1 1 1 1
symmnumber: 1
zpe: 1032371.2 jmol-1
zpe.correction: 0.393209 hartree
zpe.thermalcorrener: 0.421078 hartree
zpe.thermalcorrenthalpy: 0.422022 hartree
zpe.thermalcorrgfe: 0.331724 hartree
zpe.sumelectzpe: -1511.484401 hartree
zpe.sumelectthermal: -1511.456532 hartree
zpe.sumelectthermalent: -1511.455588 hartree
zpe.sumelectthermalfe: -1511.545886 hartree
dipole: 1.2629 18.4250 -0.2102
dipole: 18.4694
quadrupole: -75.8419 -159.2266 -173.1218
quadrupole: 7.8899 -5.0009 23.3195
quadrupole: 60.2216 -23.1632 -37.0584 7.8899 -5.0009 23.3195
hfenergy: -1511.8776101 hartree
pointgroup: C01 [X(C24H19Cr1N5O3)]
dipole: 2.7666442 6.5824575 1.3482274 debye
polarizability: 570.0251487|25.6043984|500.2364003|-37.0483831|-16.8030353|489.8476971 unknown
InChI: InChI=1S/C11H7N2O2.C8H6N2.C5H5N.Cr.H2O/c14-11(15)10-6-3-5-9(13-10)8-4-1-2-7-12-8;1-2-4-8-7(3-1)5-6-9-10-8;1-2-4-6-5-3-1;;/h1-7H;1-6H;1-5H;;1H2/q-3;2*-1;+6;/p-1
charge 1 multiplicity 4
52 atoms
Cr 0.07342452 -0.13060449 0.24061181
O  2.46852833 -3.41284433 0.34645478
C  1.95641695 -2.28078449 0.33019998
O  0.67020801 -2.0517977 0.31291861
C  2.81174485 -1.03599267 0.33539449
C  4.20146433 -0.97457557 0.37755396
C  4.79732117 0.29279261 0.40051812
C  4.01573166 1.45151602 0.38599178
C  2.62329346 1.31751427 0.33929648
C  1.6076651 2.39207013 0.32960658
C  1.89438492 3.75603238 0.36379095
C  0.8385196 4.67019706 0.34658176
C  -0.4739623 4.20267253 0.29267376
C  -0.69527066 2.82679957 0.25812809
N  0.31648959 1.94305094 0.27905843
N  2.07696907 0.08628668 0.3104657
H  4.79244805 -1.88227142 0.39601687
H  5.87771695 0.38013899 0.43513393
H  4.4818126 2.42889457 0.41258441
H  2.92096368 4.09983519 0.40101619
H  1.04424969 5.73467562 0.373908
H  -1.31767963 4.88223955 0.27537182
H  -1.69215689 2.40329766 0.21348227
O  -1.80817349 -0.23437199 0.12563024
H  -2.12442039 -0.41195964 1.03511949
N  -0.07922917 -0.14129999 2.38500241
C  0.94328414 0.11776883 3.2451544
C  0.79319493 0.00397341 4.61222835
C  -0.45455775 -0.39416017 5.12251789
C  -0.748352 -0.55904095 6.50158455
C  -2.01157178 -0.9538065 6.883431
C  -3.02931949 -1.19855888 5.91773526
C  -2.77928731 -1.04762227 4.57360776
C  -1.48238174 -0.64250988 4.15340132
N  -1.26186934 -0.50860968 2.81977192
H  1.87997107 0.4186702 2.79691363
H  1.62756776 0.21670168 5.27152608
H  0.03044505 -0.3715365 7.2334735
H  -2.24225771 -1.08319113 7.93585178
H  -4.01299412 -1.50918493 6.25393133
H  -3.54080878 -1.23089738 3.82315445
N  0.12431237 -0.19352139 -1.8498802
C  0.69925966 0.72966293 -2.65012563
C  0.69495285 0.61315009 -4.03630124
C  0.07716055 -0.4936861 -4.62113213
C  -0.51810266 -1.44741064 -3.7931985
C  -0.47576848 -1.26486348 -2.41527929
H  1.16818858 1.57791798 -2.16687118
H  1.16894605 1.3812502 -4.63645385
H  0.05966699 -0.61020127 -5.6996634
H  -1.01048822 -2.32304785 -4.20024628
H  -0.9255156 -1.97564581 -1.73296046
