program: Gaussian 09
title: /home/michael/molsimp_comfiles/Cr_3a1_21_OH/Cr_3a1_21_OH.com auto generated
version: ES64L-G09RevE.01
frameworkgroup: C1[X(C24H18CrN5O3)]
method: UTPSSh
basis: Gen
operation: Freq
keyword: #P
keyword: Geom=AllCheck
keyword: Guess=TCheck
keyword: SCRF=Check
keyword: GenChk
keyword: UTPSSh/ChkBas
keyword: Freq
title: /home/michael/molsimp_comfiles/Cr_3a1_21_OH/Cr_3a1_21_OH.com auto gene
converged: YES YES NO YES
polarizability: 5.52967704e+02 6.28453688e+01 5.26014364e+02 1.65266546e+01 -1.67559131e+01 5.11242199e+02
1716.lowfreq: -0.0003 0.0000 0.0007 2.3593 10.9706 14.0039 25.8436 30.9644 35.8066
frequency: 24.2943 30.8433 35.7380 42.8617 48.3008 63.3476 70.6587 90.6027 104.9587 107.3021 128.8128 146.3869 149.8218 165.2239 178.3098 181.2201 184.4781 195.6000 207.7011 215.4231 237.7997 262.3137 273.8281 285.8019 297.2509 299.7492 352.6080 389.4393 392.3393 394.0726 394.5197 425.2029 436.5457 443.5111 461.4277 477.6071 490.7422 500.7166 531.9591 540.0080 567.1735 578.9062 637.6152 641.1932 643.9622 652.0936 661.8587 663.5559 690.3470 695.3537 700.7476 726.0579 759.2335 764.5230 769.7712 770.0050 774.5913 782.4167 794.8428 800.9915 842.5139 847.7275 857.8246 878.2940 886.5290 893.1620 922.7530 951.7913 971.6059 974.7202 988.4509 1000.4689 1001.9832 1003.6077 1023.5426 1026.6662 1031.2272 1032.9324 1034.2766 1035.1167 1035.3894 1047.0599 1048.3927 1066.3528 1092.2562 1096.9708 1099.9311 1106.7662 1108.5496 1139.4697 1156.3372 1171.8919 1173.8713 1178.2584 1180.5685 1181.2648 1200.0102 1236.3222 1247.0292 1285.0544 1287.0204 1310.4191 1312.1060 1320.0792 1325.0987 1337.7742 1351.4395 1384.5443 1387.5075 1441.1492 1442.7905 1453.8389 1481.7175 1483.4838 1485.3688 1489.4017 1521.2000 1522.8691 1539.5527 1585.3994 1608.8388 1618.5174 1620.2806 1621.8824 1625.7775 1638.2448 1647.9713 1653.3368 1661.9865 3211.1342 3218.6277 3223.7531 3227.1420 3228.7392 3229.2984 3233.6325 3233.9126 3234.6115 3236.2097 3240.5562 3244.8451 3246.0140 3248.8452 3249.3573 3250.5884 3262.9351 3277.0084
redmass: 5.7221 5.2337 5.7807 5.6314 5.0270 4.4610 7.4509 6.3715 6.4942 4.4473 5.8041 7.7459 8.5119 5.1785 4.4844 7.0355 5.7779 8.2188 7.1109 8.1224 6.9644 6.1293 7.7985 12.8312 15.4425 9.9292 9.4741 3.6464 7.4742 2.8417 4.3527 3.6285 3.9947 4.0211 4.2589 3.1350 3.6256 8.1767 7.0672 8.0634 5.6518 4.8462 7.3616 6.8387 7.1488 6.3525 4.5238 6.9734 9.1898 11.1362 1.8561 5.6967 2.0334 1.3263 4.9956 2.0014 1.8278 5.5335 3.6426 2.1749 5.8538 2.3205 1.3266 7.7048 1.2518 1.5200 1.3174 1.4012 1.3098 5.3828 1.3217 1.3608 1.4040 1.3962 1.3213 7.2735 1.3442 1.3456 2.3093 1.6653 3.3673 6.5458 6.4805 3.0787 1.7245 2.4334 3.1775 1.7412 1.6343 1.8254 1.5374 1.2492 1.0736 1.4012 1.4147 1.3250 1.5051 1.2111 2.9641 1.7951 3.4613 2.6406 1.6223 5.6441 8.2587 3.0848 3.4972 1.2462 4.7679 5.3187 2.7027 2.0709 2.2851 2.4123 2.4320 2.4337 1.9685 3.2386 3.1464 6.6250 5.5815 6.9999 5.5242 5.8740 9.2531 6.3883 6.3637 5.2822 5.6847 1.0873 1.0895 1.0888 1.0958 1.0892 1.0901 1.0987 1.0929 1.0918 1.0900 1.0951 1.0943 1.0933 1.0981 1.0975 1.0991 1.0942 1.0943
irintensity: 1.7990 6.2180 3.7196 4.7539 1.2635 0.9012 5.3960 0.9429 3.5793 3.8219 0.8963 2.4189 5.8217 3.8277 6.9396 4.4596 19.2796 17.8537 3.8978 5.5453 23.0725 24.3432 26.9036 164.1378 164.1843 14.0377 5.3559 1.1251 51.9495 3.1641 5.0561 12.7363 23.5028 20.4256 6.1273 10.1777 0.9949 17.1645 1.9234 14.3372 2.2392 1.6756 11.6875 17.8512 28.4091 0.9796 2.8042 20.6917 38.9633 188.0887 68.2432 54.7983 1.4910 50.6612 24.6740 76.2822 104.7682 22.3091 7.6580 32.8233 11.3120 10.1211 81.7214 48.0366 0.0443 7.5590 0.0909 0.0392 1.6352 1.2126 0.8538 3.6818 0.3873 1.2157 0.0029 41.8179 0.0733 0.2293 8.9568 10.4031 23.5258 46.3451 14.9400 8.6172 54.9128 47.2375 14.6330 5.4974 28.3189 18.1394 9.9998 12.5710 3.4092 88.7914 34.0820 12.4990 90.2713 27.6335 13.0035 3.3301 306.3562 13.8802 18.7112 48.9270 5.0757 18.5063 115.3135 19.2037 126.0885 73.8066 6.6809 17.7397 67.8392 20.9368 14.7039 253.4969 4.9961 31.4487 16.6905 16.3037 8.2509 178.0589 104.5066 44.8175 1132.0246 188.2520 5.4384 61.0649 7.3350 0.5696 4.0062 3.8692 14.0412 7.2306 3.5151 16.1917 1.2871 1.1575 0.8476 0.4574 0.2640 0.6030 5.7422 0.2958 3.9028 10.4800 5.6339
temp: 298.150 k
press: 1.00000 atm
elementType: 24 8 6 8 6 6 6 6 6 6 6 6 6 6 7 7 1 1 1 1 1 1 1 8 7 6 6 6 6 6 6 6 6 7 1 1 1 1 1 1 7 6 6 6 6 6 1 1 1 1 1
symmnumber: 1
zpe: 1003955.9 jmol-1
zpe.correction: 0.382387 hartree
zpe.thermalcorrener: 0.409645 hartree
zpe.thermalcorrenthalpy: 0.410589 hartree
zpe.thermalcorrgfe: 0.323013 hartree
zpe.sumelectzpe: -1510.833359 hartree
zpe.sumelectthermal: -1510.806101 hartree
zpe.sumelectthermalent: -1510.805157 hartree
zpe.sumelectthermalfe: -1510.892733 hartree
dipole: 6.8728 16.6513 10.0393
dipole: 20.6225
quadrupole: -71.7280 -174.0977 -157.8467
quadrupole: -6.5517 -1.5901 5.0408
quadrupole: 62.8294 -39.5402 -23.2892 -6.5517 -1.5901 5.0408
hfenergy: -1511.215746 hartree
pointgroup: C01 [X(C24H18Cr1N5O3)]
dipole: 3.1519881 7.4757224 -0.0884385 debye
polarizability: 521.4725883|-0.7290797|555.8127135|-11.8470288|-65.5372388|512.9389652 unknown
InChI: InChI=1S/C11H7N2O2.C8H6N2.C5H5N.Cr.O/c14-11(15)10-6-3-5-9(13-10)8-4-1-2-7-12-8;1-2-4-8-7(3-1)5-6-9-10-8;1-2-4-6-5-3-1;;/h1-7H;1-6H;1-5H;;/q-3;2*-1;+5;
charge 1 multiplicity 3
51 atoms
Cr -0.17494158 -0.14049145 0.26448851
O  2.14397393 -3.41731343 0.92419087
C  1.67950985 -2.2902456 0.69216377
O  0.41787233 -2.0519598 0.43155088
C  2.56723144 -1.06636112 0.66988135
C  3.95002105 -1.02406096 0.82194094
C  4.5736671 0.22745911 0.72609003
C  3.82756536 1.38707618 0.49460785
C  2.43815754 1.26887041 0.36396456
C  1.4481171 2.34828264 0.16042345
C  1.77347414 3.69539266 0.01093441
C  0.74634324 4.6302443 -0.13812798
C  -0.57924994 4.19849024 -0.12609436
C  -0.84022729 2.83689818 0.02210691
N  0.14413766 1.93244515 0.15670406
N  1.86812385 0.05544392 0.45274274
H  4.51636716 -1.92992165 1.00159133
H  5.65037435 0.30101539 0.83323523
H  4.31675102 2.35113582 0.42455907
H  2.81065802 4.00845295 0.01265084
H  0.98405913 5.68165223 -0.25675183
H  -1.40376505 4.89368495 -0.23039975
H  -1.85080667 2.44462577 0.03477126
O  -1.83483605 -0.19237509 0.11839253
N  -0.23286047 -0.07053944 2.37506542
C  0.34224687 0.88844116 3.1515477
C  0.25605599 0.85349643 4.52745845
C  -0.44711587 -0.2041878 5.13040916
C  -0.61318575 -0.36905563 6.53041392
C  -1.3265527 -1.44715217 7.00656069
C  -1.9019615 -2.39931944 6.11772298
C  -1.76042415 -2.26948903 4.75575061
C  -1.0265942 -1.16631491 4.23778888
N  -0.90430411 -1.07175704 2.88761897
H  0.86601617 1.67989562 2.6342252
H  0.72392314 1.63025451 5.12211561
H  -0.17399116 0.35936656 7.20407389
H  -1.45654384 -1.5790834 8.07584773
H  -2.45759461 -3.23635412 6.52730068
H  -2.19032084 -2.98465856 4.06268704
N  0.10293207 -0.15975975 -1.82328358
C  1.12115269 -0.79214709 -2.44459873
C  1.27688221 -0.76754241 -3.82678673
C  0.35371823 -0.06444973 -4.6015542
C  -0.70199453 0.5858737 -3.95992251
C  -0.79781733 0.51567978 -2.57548501
H  1.82286927 -1.33103961 -1.82201551
H  2.11156365 -1.29356727 -4.27518727
H  0.45260088 -0.02684999 -5.6812007
H  -1.45007583 1.1389834 -4.51591138
H  -1.60855198 0.99594743 -2.04157598
