program: Gaussian 09
title: /home/michael/molsimp_comfiles/Cr_31a_5_OH/Cr_31a_5_OH.com auto generated
version: ES64L-G09RevE.01
frameworkgroup: C1[X(C29H24CrN5O)]
method: UTPSSh
basis: Gen
operation: Freq
keyword: #P
keyword: Geom=AllCheck
keyword: Guess=TCheck
keyword: SCRF=Check
keyword: GenChk
keyword: UTPSSh/ChkBas
keyword: Freq
title: /home/michael/molsimp_comfiles/Cr_31a_5_OH/Cr_31a_5_OH.com auto genera
converged: YES YES NO YES
polarizability: 2.25845705e+03 8.07486613e+01 6.45014124e+02 -2.51883747e+02 4.23574610e+01 4.93667159e+02
1716.lowfreq: -9.6732 -1.4428 0.0006 0.0007 0.0010 14.1261 23.5956 27.6211 33.7641
frequency: 22.8580 25.8375 33.4205 42.1025 46.9425 55.9789 70.7711 84.5225 98.8618 108.0613 118.8787 124.3196 136.2776 147.2069 151.7060 167.6350 176.1188 183.3604 186.4811 196.7919 216.6678 233.3955 241.1611 246.5846 262.4299 288.4671 299.5060 316.5105 349.8811 356.3924 376.2913 377.6654 395.6792 421.6940 426.4400 431.9775 432.7063 445.5992 450.5803 454.3147 455.7670 499.3847 506.7653 519.7754 535.7175 537.3721 595.6857 626.2309 635.2736 638.7931 643.9978 649.5489 650.8766 653.2784 672.8650 705.2261 731.3234 738.2186 740.4109 755.6888 760.4296 762.0498 767.7726 770.1757 784.4219 789.9153 799.1102 833.6414 841.1428 842.1841 850.9273 891.2428 900.5894 919.0955 921.0533 942.3422 961.0136 968.7605 973.2274 992.5625 995.6445 999.7404 1004.8447 1010.6177 1029.1149 1029.6629 1029.9063 1031.1522 1031.9765 1033.2009 1033.8926 1034.3326 1046.1189 1049.0896 1050.4324 1054.9896 1074.3539 1086.4280 1090.9800 1100.0763 1109.6050 1119.8513 1127.4505 1127.6157 1142.9619 1164.5327 1174.0572 1179.6018 1184.3935 1184.9041 1189.1060 1215.1189 1243.3205 1248.2111 1274.9540 1302.4148 1310.6952 1320.5927 1322.5841 1324.6830 1330.1571 1330.5287 1346.9061 1370.5497 1374.0266 1403.3624 1406.7608 1420.8288 1435.7937 1459.1590 1476.8241 1481.6106 1488.3571 1498.0561 1499.9758 1519.2052 1532.9265 1542.5657 1546.8565 1559.1275 1568.6763 1595.7958 1607.7773 1616.0095 1618.9979 1621.3248 1641.1012 1648.1597 1651.6161 1655.7651 3222.6490 3227.8133 3228.4672 3228.7762 3231.6311 3231.7485 3232.0984 3234.4721 3237.6635 3239.2383 3241.3507 3241.5282 3244.4485 3245.4185 3246.3207 3247.7717 3251.1883 3254.1688 3254.7947 3255.2031 3258.5937 3259.0840 3265.5504 3739.2892
redmass: 5.7223 5.6244 5.2100 5.3197 4.2125 5.1537 4.3577 4.3847 4.8532 6.1400 5.1471 4.8468 5.4583 5.1938 5.6422 4.6002 4.4992 5.4556 5.3739 3.0507 1.5922 3.7516 4.8942 5.5870 7.1661 6.2568 7.4843 11.3153 6.6799 8.7849 3.1563 4.1352 2.6894 3.2921 2.8510 3.7590 3.8356 5.9177 4.3383 3.4843 3.8894 12.9109 7.0905 3.1851 7.7722 5.4348 2.8939 6.8229 3.9118 6.8965 7.1285 6.8534 6.9575 6.3887 6.9236 1.7326 6.6379 2.2417 4.3066 1.8369 1.8721 1.4541 1.6572 1.3429 1.2166 4.7111 1.8845 5.3031 3.0851 3.3839 1.3150 1.2493 1.4556 1.3080 1.3341 1.4120 5.2329 1.4896 1.3195 1.4282 1.3930 1.3750 1.4188 1.5131 1.6118 1.4258 3.9278 6.4746 5.3896 1.4433 1.3350 1.3652 2.6615 7.1786 6.3867 7.3762 2.2490 2.5331 1.7003 1.9373 1.8034 1.8918 1.6249 1.6803 1.7145 1.5905 1.0758 1.2629 1.1199 1.4003 1.1351 1.2914 1.6295 1.3464 1.8748 2.6026 2.3420 2.7832 3.5618 7.8892 2.4715 3.7460 1.8315 3.1439 4.2228 1.2189 2.3375 2.6790 2.2523 2.2023 2.2566 2.2741 2.0629 2.4847 2.0205 2.6426 1.8579 3.0187 4.0518 3.1431 6.0020 4.6809 5.8376 5.3151 5.6166 4.9163 5.2481 5.4417 5.8915 4.8401 1.0886 1.0915 1.0932 1.0893 1.0912 1.0896 1.0894 1.0906 1.0942 1.0934 1.0917 1.0924 1.0923 1.0977 1.0962 1.0982 1.0957 1.0956 1.0941 1.0967 1.0957 1.0966 1.0945 1.0659
irintensity: 1.6558 1.5443 1.2778 2.1632 0.4658 7.1089 4.7197 1.4580 3.0954 58.3928 0.5055 18.9050 52.2318 3.7663 84.8197 4.1502 8.0714 16.7951 39.9025 4.0565 214.7665 75.6518 19.2879 40.0622 74.8358 58.3559 14.9560 69.0228 9.9544 73.5077 30.2491 14.2134 0.3046 25.6327 59.4901 73.0350 0.8649 195.6851 24.6092 40.6223 1.6280 5101.2704 72.2432 9.5650 48.6709 1.5770 61.5284 81.1538 1.1744 22.9474 1.9523 49.8663 2.9923 10.2543 11.4174 85.8601 21.3521 119.3527 48.8696 19.5987 38.0886 71.7721 84.6290 67.7356 291.4631 7.8841 1.1323 7.6866 6.0074 5.7697 39.5917 0.4483 108.1296 0.1621 0.6279 0.1572 33.9402 143.0923 21.6692 233.2281 1.1604 3.6143 0.6990 88.5444 3.3699 11.5729 4.4931 42.8098 62.9760 6.6844 0.7108 0.7658 362.4184 77.4958 0.8028 18.5219 18.6318 6.9108 51.9261 14.8692 1.4052 26.0203 29.5131 9.5300 159.9838 3.1984 6.9723 1210.8457 16.3212 130.2843 43.2161 19.6644 1913.9880 137.9964 522.7268 969.4008 147.6819 62.1701 1241.4972 3.1573 47.6807 1620.4143 89.8030 60.9766 115.0903 3.3103 1740.6433 766.2557 1.6571 254.9510 67.8786 98.5043 153.4775 120.5684 25.8899 400.8615 32.3638 48.1047 305.1027 1600.4115 1176.3732 1756.4004 44.2572 73.4187 40.9820 6.9512 63.8728 100.2105 1.0601 51.8799 2.8283 2.1832 1.7623 5.2880 9.5390 4.3130 2.8877 5.1099 3.0842 1.5302 0.9155 0.8830 0.0901 4.2499 1.9432 126.0969 0.1365 31.0178 2.7575 3.6913 1.8072 3.6515 0.8944 3143.6936
temp: 298.150 k
press: 1.00000 atm
elementType: 24 6 6 6 6 6 6 6 6 6 6 6 6 6 6 7 7 7 6 1 1 1 1 1 1 1 1 1 1 1 7 6 6 6 6 6 6 6 6 6 1 1 1 1 1 1 1 7 6 6 6 6 6 1 1 1 1 1 8 1
symmnumber: 1
zpe: 1241826.7 jmol-1
zpe.correction: 0.472987 hartree
zpe.thermalcorrener: 0.503133 hartree
zpe.thermalcorrenthalpy: 0.504077 hartree
zpe.thermalcorrgfe: 0.410779 hartree
zpe.sumelectzpe: -1554.156336 hartree
zpe.sumelectthermal: -1554.126190 hartree
zpe.sumelectthermalent: -1554.125246 hartree
zpe.sumelectthermalfe: -1554.218544 hartree
dipole: -10.7386 1.3342 3.5396
dipole: 11.3853
quadrupole: 13.6497 -95.3854 -163.3893
quadrupole: 6.6995 9.6320 4.4869
quadrupole: 95.3580 -13.6770 -81.6810 6.6995 9.6320 4.4869
hfenergy: -1554.6293231 hartree
pointgroup: C01 [X(C29H24Cr1N5O1)]
dipole: -4.187973 0.7808309 1.3840328 debye
polarizability: 2262.4627562|-14.7992337|642.2296047|-248.6612499|55.2089939|492.4459675 unknown
InChI: InChI=1S/C15H11N3.C9H7N.C5H5N.Cr.H2O/c1-3-10-16-12(6-1)14-8-5-9-15(18-14)13-7-2-4-11-17-13;1-2-4-9-7-10-6-5-8(9)3-1;1-2-4-6-5-3-1;;/h1-11H;1-7H;1-5H;;1H2/q-3;2*-1;+6;/p-1
charge 3 multiplicity 3
60 atoms
Cr 0.48996047 -0.08494151 -0.60745451
C  -0.12967386 4.24668341 -0.79484607
C  1.1712139 4.72816538 -0.65735659
C  2.22125454 3.82222712 -0.50300597
C  1.94194894 2.45649268 -0.48075983
C  2.96247274 1.40562202 -0.33687007
C  4.33379059 1.60812571 -0.16660269
C  5.1627946 0.49143766 -0.05121124
C  4.62851569 -0.79600218 -0.11360402
C  3.24969674 -0.94116352 -0.28706843
C  2.51823523 -2.21236244 -0.40226968
C  3.11738601 -3.47086577 -0.34948479
C  2.32299467 -4.60767316 -0.50474968
C  0.95259992 -4.45948218 -0.71221616
C  0.41472304 -3.17454256 -0.74703152
N  1.17456349 -2.07643831 -0.59072654
N  2.46048123 0.15139558 -0.38481141
N  0.66211747 1.99243023 -0.59987483
C  -0.3443706 2.87094151 -0.76417506
H  -0.97259984 4.91423226 -0.92655821
H  1.37258747 5.79339857 -0.67575773
H  3.24111023 4.17276879 -0.40519386
H  4.74618558 2.60821538 -0.1248533
H  6.23016219 0.62533818 0.08385549
H  5.2718448 -1.66303358 -0.03344057
H  4.18496085 -3.56397946 -0.19336928
H  2.77383269 -5.59307052 -0.46680676
H  0.30139727 -5.31518858 -0.84389238
H  -0.64663102 -3.01645263 -0.89902898
H  -1.34032498 2.46348204 -0.881073
N  -1.64265084 -0.17280868 -0.7043912
C  -2.19857911 -0.80698093 -1.76596331
C  -3.58556391 -0.91761577 -1.94003543
C  -4.44652589 -0.36069716 -0.98479379
C  -5.8678581 -0.43122915 -1.08282587
C  -6.6678519 0.14939049 -0.09407795
C  -6.08478839 0.80409131 0.99666428
C  -4.6861202 0.88863974 1.11784498
C  -3.85760455 0.30810812 0.13239281
C  -2.45205997 0.36402305 0.22613701
H  -1.50360924 -1.22594072 -2.4833015
H  -3.97281932 -1.4251141 -2.81640323
H  -6.3142256 -0.94120626 -1.9298884
H  -7.74716725 0.08990822 -0.17520537
H  -6.71215744 1.2538866 1.75775523
H  -4.23835023 1.39925771 1.9640896
H  -1.98207001 0.85964803 1.06908548
N  0.32679883 -0.2153637 1.53025424
C  -0.32555035 -1.27157835 2.07127095
C  -0.46510541 -1.44000427 3.44416906
C  0.08558401 -0.48657638 4.30306916
C  0.75524679 0.60541974 3.74990354
C  0.85436602 0.70680201 2.3659398
H  -0.74685739 -1.99272679 1.37994377
H  -0.99746065 -2.30484799 3.82260997
H  -0.00710573 -0.59236297 5.37873782
H  1.19803191 1.37467847 4.3717879
H  1.36733007 1.54617977 1.91378322
O  0.54938635 -0.10536865 -2.4595545
H  0.41308747 0.77763153 -2.84679362
