program: Gaussian 09
title: /home/michael/molsimp_comfiles/Cr_31a_3_OH/Cr_31a_3_OH.com auto generated
version: ES64L-G09RevE.01
frameworkgroup: C1[X(C28H22CrN6O)]
method: UTPSSh
basis: Gen
operation: Freq
keyword: #P
keyword: Geom=AllCheck
keyword: Guess=TCheck
keyword: SCRF=Check
keyword: GenChk
keyword: UTPSSh/ChkBas
keyword: Freq
title: /home/michael/molsimp_comfiles/Cr_31a_3_OH/Cr_31a_3_OH.com auto genera
converged: YES YES YES YES
polarizability: 7.24108477e+02 1.11222289e+01 6.35776173e+02 -1.53093124e+01 4.47741050e+01 4.35106442e+02
1716.lowfreq: -9.7191 0.0004 0.0007 0.0009 4.4083 10.5321 20.9794 28.1128 30.5964
frequency: 20.7523 28.0933 29.6952 34.4078 43.6802 59.5013 61.1869 82.8978 96.8055 97.0761 113.2970 115.9345 131.0373 132.9511 153.2792 159.2445 174.6869 181.2129 186.2664 206.1001 233.2560 236.2289 246.6311 257.1325 297.1823 310.4766 319.7601 353.6085 368.8248 388.7478 390.9755 396.0667 422.5683 427.7217 436.1541 445.2552 454.2387 457.8736 476.5622 488.4361 520.7638 530.9867 537.7714 540.4414 631.0026 632.7466 638.1539 646.0749 650.0182 652.5422 655.5633 660.6933 671.9219 703.0185 730.0587 738.9391 752.4570 760.9883 764.8915 767.6432 780.7384 785.1495 795.9846 799.5116 800.2507 840.0970 841.5011 842.4682 865.9857 886.8751 897.2699 914.4598 917.1202 941.2793 965.7109 974.0567 991.8741 996.1900 997.7640 999.1788 1003.3872 1025.6257 1026.2631 1027.2533 1028.0857 1031.7323 1033.0500 1034.5081 1035.2893 1035.7821 1048.9063 1050.9598 1052.6711 1078.5411 1089.8883 1090.4252 1097.2591 1107.0249 1118.5771 1131.5047 1144.5445 1156.3008 1163.7562 1171.6513 1171.9067 1178.5289 1180.2593 1189.1031 1231.6181 1244.6680 1247.6697 1284.8903 1307.6258 1312.6066 1314.4379 1321.6558 1326.5812 1331.6785 1335.1256 1348.1530 1373.0081 1394.8631 1397.1707 1438.5529 1438.9644 1450.9540 1476.7565 1477.3500 1483.7520 1487.3584 1497.1436 1516.9323 1530.5280 1536.4684 1547.5127 1583.6719 1608.3461 1615.5507 1619.6318 1620.3980 1622.6390 1643.0410 1649.8625 1653.3823 1653.9407 1661.6986 3212.4652 3218.3970 3220.1026 3229.0933 3229.2136 3230.6113 3230.6904 3231.4055 3232.7795 3234.4054 3235.2132 3235.7014 3243.0183 3243.5147 3247.2679 3248.3671 3248.8488 3251.5608 3253.5716 3255.6188 3262.8444 3267.3538
redmass: 5.1908 5.4908 5.4119 4.6904 4.9550 4.3663 5.5928 4.4076 5.8908 6.7637 5.4395 4.5939 6.9162 6.4714 5.7832 6.0776 5.2096 5.4542 4.4230 7.2406 5.3923 8.0157 4.6454 7.9900 6.3294 8.8696 12.0677 7.0559 9.2551 3.1948 3.1030 4.8816 3.6464 3.7155 3.7395 5.9077 4.2983 4.0650 3.2220 3.5289 3.1739 7.1290 6.6658 6.1461 5.9637 4.1523 7.2874 7.2006 7.1492 6.7785 6.4460 4.5634 6.9143 1.6528 6.7083 4.1561 2.0564 2.2237 1.9221 1.3196 5.5671 1.2053 3.6824 3.8098 2.8097 2.4095 5.9157 5.2621 1.3180 1.2502 1.4995 1.3431 1.3382 1.4119 1.3064 5.3179 1.3236 1.4141 1.3942 1.4025 1.3567 1.3190 1.3490 6.7701 1.3465 6.2837 1.3541 2.3150 1.5342 4.7871 7.0980 6.3544 6.8722 2.3812 3.0306 1.7299 2.0543 1.8014 1.8324 1.6562 1.6718 1.5299 1.6060 1.1503 1.1466 1.2941 1.0853 1.1648 1.4518 1.3797 2.3481 1.8131 2.0610 2.5171 2.3776 8.0469 10.3751 3.0691 3.0829 2.0322 4.3950 2.3055 1.2173 2.4972 3.7304 2.2492 2.2060 2.2374 2.4267 2.1119 2.4981 2.9567 1.8791 3.1144 2.8287 6.7764 5.8396 5.4876 6.0626 5.8644 5.0275 5.3331 5.7955 4.8282 4.8383 5.6591 1.0873 1.0881 1.0895 1.0957 1.0889 1.0925 1.0898 1.0897 1.0906 1.0939 1.0984 1.0932 1.0954 1.0909 1.0957 1.0949 1.0965 1.0951 1.0990 1.0989 1.0938 1.0951
irintensity: 0.1597 1.0328 0.4048 3.2595 1.3663 2.0206 6.2625 0.5258 0.4623 9.1378 4.6312 3.6192 11.4685 6.2256 3.5367 3.7915 3.7137 0.6726 11.0232 4.8605 8.1199 0.6499 2.0149 10.0235 9.0547 41.8206 59.8695 18.6548 113.5993 1.3101 0.9812 4.2041 8.6665 15.7495 11.8972 1.3150 7.9352 0.1771 9.6466 0.1968 9.1548 4.4890 9.9190 6.7203 9.8617 2.9775 10.7667 6.4579 10.7770 29.4157 11.9613 5.5620 30.9385 103.7841 3.6281 24.6370 5.2064 2.5143 26.2197 56.8889 23.0617 264.1528 9.3348 122.2586 86.6928 8.1056 16.8167 3.2749 79.6509 0.2930 10.5526 0.2270 0.4170 0.1217 1.9667 2.7778 1.9989 0.2275 1.7329 0.8906 3.1785 0.0362 0.5169 29.2798 0.5904 30.5037 0.7195 7.0658 1.2504 25.5453 35.1539 10.6367 1.7565 9.6169 27.9534 39.5469 6.5763 1.0140 23.9800 12.5850 7.1018 11.6153 2.5855 18.4274 5.7969 7.3867 7.9453 10.0030 17.5936 30.6066 11.2205 0.6562 9.7009 29.1024 4.5132 0.9553 33.9641 87.1192 18.5291 21.7409 46.2616 22.3285 4.9349 40.2037 37.9735 30.0489 17.0728 83.7656 20.9955 193.0678 9.9081 173.6822 4.9130 12.4897 33.0641 11.0711 24.3152 28.7638 34.0319 66.1804 11.9432 78.7695 34.2482 55.1099 58.4528 8.6434 0.7242 2.7083 4.3877 15.4137 1.0242 1.7996 6.1193 6.0201 4.0891 3.2963 15.5367 2.5402 17.3782 7.4346 0.8333 0.4897 7.5738 0.4629 1.7025 7.0519 0.0118 5.1912
temp: 298.150 k
press: 1.00000 atm
elementType: 24 6 6 6 6 6 6 6 6 6 6 6 6 6 6 7 7 7 6 1 1 1 1 1 1 1 1 1 1 1 7 6 6 6 6 6 6 6 6 7 1 1 1 1 1 1 7 6 6 6 6 6 1 1 1 1 1 8
symmnumber: 1
zpe: 1183626.9 jmol-1
zpe.correction: 0.450820 hartree
zpe.thermalcorrener: 0.480076 hartree
zpe.thermalcorrenthalpy: 0.481020 hartree
zpe.thermalcorrgfe: 0.388576 hartree
zpe.sumelectzpe: -1569.755314 hartree
zpe.sumelectthermal: -1569.726057 hartree
zpe.sumelectthermalent: -1569.725113 hartree
zpe.sumelectthermalfe: -1569.817558 hartree
dipole: 3.4237 -1.4120 4.2834
dipole: 5.6624
quadrupole: -58.5889 -102.7351 -182.6236
quadrupole: 7.1300 8.9657 5.9900
quadrupole: 56.0603 11.9141 -67.9744 7.1300 8.9657 5.9900
hfenergy: -1570.2061335 hartree
pointgroup: C01 [X(C28H22Cr1N6O1)]
dipole: 1.5956102 -0.7109867 1.3825717 debye
polarizability: 710.4538921|15.0718516|631.0836246|-64.5083668|50.8883287|453.4535747 unknown
InChI: InChI=1S/C15H11N3.C8H6N2.C5H5N.Cr.O/c1-3-10-16-12(6-1)14-8-5-9-15(18-14)13-7-2-4-11-17-13;1-2-4-8-7(3-1)5-6-9-10-8;1-2-4-6-5-3-1;;/h1-11H;1-6H;1-5H;;/q-3;-1;;+4;
charge 2 multiplicity 3
58 atoms
Cr -0.22313053 -0.01713365 -0.29075779
C  -0.05207852 -4.37875021 -0.24401822
C  1.3141791 -4.61974147 -0.37693347
C  2.192701 -3.53992057 -0.47175518
C  1.68350648 -2.2424904 -0.42843312
C  2.49820942 -1.02136565 -0.52021753
C  3.88391747 -0.95418129 -0.68934837
C  4.48807505 0.30276834 -0.74667148
C  3.72262313 1.46371485 -0.62757518
C  2.34103267 1.33516807 -0.46309667
C  1.37378017 2.42895453 -0.27809396
C  1.69697014 3.78492583 -0.29696386
C  0.69294735 4.72560905 -0.06320272
C  -0.60703645 4.28902761 0.18759064
C  -0.8712872 2.92130887 0.18331908
N  0.09335175 2.01354929 -0.04585073
N  1.77278342 0.11170388 -0.42040219
N  0.34477645 -2.01830016 -0.28852035
C  -0.50056874 -3.06064954 -0.20379177
H  -0.76920415 -5.1875443 -0.1722946
H  1.69646723 -5.63391798 -0.40901402
H  3.25774472 -3.70585671 -0.57599742
H  4.47842998 -1.85510102 -0.77446509
H  5.5616816 0.37782619 -0.87753231
H  4.1903862 2.43972012 -0.6556152
H  2.71536328 4.09927825 -0.48872339
H  0.92881902 5.78388724 -0.07453428
H  -1.41397958 4.98587824 0.37951881
H  -1.86654421 2.53715379 0.36810177
H  -1.5540871 -2.83006387 -0.10362651
N  -2.32494736 -0.10480472 -0.02749082
C  -3.10366309 -0.69927443 -0.97526109
C  -4.47517183 -0.76530853 -0.84793294
C  -5.0727718 -0.18570488 0.28604101
C  -6.46826205 -0.17552048 0.54486414
C  -6.94250141 0.42810523 1.68888964
C  -6.0562034 1.04417707 2.61763678
C  -4.69831992 1.05262342 2.39837748
C  -4.18179944 0.43367666 1.2259274
N  -2.8346003 0.45109114 1.04612897
H  -2.56901302 -1.1040866 -1.82457545
H  -5.07323389 -1.25025887 -1.61177919
H  -7.1406035 -0.64446565 -0.16603644
H  -8.00840984 0.43817608 1.89212868
H  -6.46405427 1.51038522 3.50837571
H  -4.00713761 1.51466572 3.0950884
N  0.01635543 -0.2303945 1.93797193
C  -0.72534088 -1.14318649 2.60440912
C  -0.60596483 -1.36016566 3.9733251
C  0.31475353 -0.60283676 4.69977554
C  1.08330704 0.34303534 4.02039911
C  0.90652286 0.49544622 2.64779489
H  -1.43583871 -1.71586464 2.01993774
H  -1.22743261 -2.10912873 4.45080186
H  0.43051883 -0.74742386 5.76887256
H  1.8127313 0.95776473 4.53528996
H  1.4956569 1.22253557 2.10219221
O  -0.4441133 0.08095307 -1.91621517
