program: Gaussian 09
title: /home/michael/molsimp_comfiles/Cr_31a_28_OH/Cr_31a_28_OH.com auto generated
version: ES64L-G09RevE.01
frameworkgroup: C1[X(C25H17CrN3O5)]
method: UTPSSh
basis: Gen
operation: Freq
keyword: #P
keyword: Geom=AllCheck
keyword: Guess=TCheck
keyword: SCRF=Check
keyword: GenChk
keyword: UTPSSh/ChkBas
keyword: Freq
title: /home/michael/molsimp_comfiles/Cr_31a_28_OH/Cr_31a_28_OH.com auto gene
converged: YES YES YES YES
polarizability: 6.14289460e+02 1.39052179e+01 5.02694357e+02 -8.38452723e+01 -7.28181390e+01 4.96510521e+02
1716.lowfreq: -15.9855 -7.2203 0.0008 0.0010 0.0011 9.1831 14.8228 21.0286 30.3656
frequency: 13.8920 20.0906 29.6747 34.5223 36.3651 52.4098 66.7917 82.2553 96.1056 103.8687 109.8348 121.0282 142.9296 147.5049 171.5614 175.2399 177.7215 185.4193 187.1135 224.3669 228.6117 249.9053 260.0118 288.0186 292.3535 323.3772 353.9860 371.8184 376.1144 389.5120 390.1908 413.5698 426.8766 454.1880 474.0120 474.1905 475.0107 486.8078 488.5797 522.4660 523.6069 526.8731 537.6497 544.8009 591.4774 641.5908 642.7321 645.2198 647.4701 682.1267 687.9310 723.1861 762.0424 764.5875 771.2283 778.6469 779.2555 787.2389 791.7418 797.7428 803.5032 820.9395 827.4901 840.3721 847.3143 848.8185 858.3272 888.8899 890.3659 921.2836 946.0362 953.8341 960.8068 962.9684 963.2413 979.2555 979.4502 989.4609 990.4763 1016.6135 1017.7835 1032.6437 1039.8390 1040.6064 1052.2921 1059.3314 1067.8909 1098.2865 1156.2556 1157.5563 1165.3928 1175.3196 1175.4194 1175.9883 1198.0073 1199.2459 1202.4561 1248.5996 1250.4421 1277.6857 1280.2937 1282.0818 1293.6445 1304.1074 1338.2531 1376.3508 1379.7442 1395.1303 1412.4466 1415.8656 1431.3612 1432.1933 1451.3343 1473.4664 1474.4377 1494.7783 1497.5637 1509.2711 1542.7359 1543.4974 1608.3829 1610.8587 1622.4462 1625.4231 1640.7976 1640.9994 1641.6090 1656.6520 1671.7770 1673.3645 3199.1430 3200.5553 3203.4319 3205.1461 3213.6668 3213.9784 3214.8297 3216.4643 3219.7862 3223.5038 3224.0143 3224.5923 3230.4437 3239.6936 3243.3292 3246.0806 3250.0115
redmass: 6.4431 5.5117 7.6044 4.6344 5.2649 5.9220 7.1344 11.8207 7.2433 6.8071 7.8146 8.4491 9.2637 10.0801 7.6332 4.9151 5.2526 3.9095 4.7874 5.9668 8.4656 8.2231 9.2799 7.9512 14.3841 15.1045 15.2159 4.3551 4.4582 3.1558 3.1197 13.7323 10.7376 4.1148 3.4039 4.4128 3.1736 3.2926 3.2301 6.8388 6.8036 7.9389 8.1054 10.6345 7.2911 6.4179 6.3760 3.6560 3.7083 7.5610 7.8305 11.4057 1.2318 1.2236 1.8110 3.7034 3.8996 4.7143 4.9736 7.8825 11.8575 6.1791 6.2712 14.6745 1.3617 1.3596 2.6128 1.4061 1.4034 8.2012 1.4741 1.4074 5.1286 1.4035 5.0776 1.3174 1.3186 1.3826 1.3886 1.3039 1.2974 1.3519 2.3542 2.4058 5.2528 2.5840 2.6183 1.8984 1.4802 1.4889 3.0019 1.2433 1.2662 1.1488 2.8667 1.4181 1.4378 2.1563 2.1614 3.2126 1.6519 1.6701 1.8234 1.9168 8.7441 3.4912 3.4867 5.0179 1.7332 1.6548 7.4938 7.2248 3.4556 2.3913 2.4640 2.0752 2.0403 3.0967 3.1525 3.2296 6.4154 6.0865 10.1823 8.6429 6.5168 5.4702 5.0556 12.5463 6.0263 5.9563 1.0867 1.0866 1.0890 1.0891 1.0949 1.0925 1.0951 1.0900 1.0902 1.0917 1.0961 1.0983 1.0902 1.0959 1.0961 1.0935 1.0972
irintensity: 1.7025 0.0938 4.2465 1.8124 2.9430 3.2575 2.5856 21.8344 10.9191 2.0073 10.9880 1.5050 3.2879 1.1856 9.3313 2.6866 13.1375 5.3867 4.1885 2.3272 29.1259 31.7958 18.1251 21.5757 65.1712 155.2384 92.3605 1.3326 6.8099 2.9009 0.8170 43.6012 64.6338 11.6840 7.8613 1.9389 2.0751 41.5488 28.5084 0.1955 0.2697 8.2965 17.7127 6.7280 10.0351 20.0528 24.6284 8.3619 9.3491 50.3438 68.8773 193.5018 39.8667 36.0853 80.3618 2.3740 2.8138 0.6503 3.0624 3.0106 13.3168 6.4756 19.2167 430.8871 74.7655 73.0562 17.5080 14.3878 11.8534 70.3999 6.6566 7.5484 12.8964 0.1011 11.0253 1.7846 1.1550 4.2333 4.2128 0.0181 0.0062 0.3326 12.6469 12.7001 52.0722 41.8167 76.6625 128.4685 2.6032 2.6514 218.5063 55.9543 27.6506 7.8770 52.6625 28.9834 10.5125 9.9174 15.4518 32.3419 1.5261 3.0047 17.2449 29.4762 1077.2478 4.2843 1.8117 35.9722 40.5478 30.7616 49.3202 41.9402 28.9774 5.7324 8.2349 15.1084 11.3088 33.2329 25.8407 14.5298 4.2503 40.4624 959.5981 766.8913 120.9226 153.9479 19.5561 864.5775 94.6560 78.8576 1.8395 1.1863 0.8905 0.7626 31.2517 2.6969 28.8815 3.7990 3.5616 9.4823 34.8060 29.9212 2.3628 9.5047 8.9118 0.6537 0.1118
temp: 298.150 k
press: 1.00000 atm
elementType: 24 8 6 8 6 6 6 6 6 6 8 8 7 1 1 1 7 6 6 6 6 6 6 6 6 6 1 1 1 1 1 1 1 7 6 6 6 6 6 6 6 6 6 1 1 1 1 1 1 1 8
symmnumber: 1
zpe: 981628.5 jmol-1
zpe.correction: 0.373883 hartree
zpe.thermalcorrener: 0.402069 hartree
zpe.thermalcorrenthalpy: 0.403013 hartree
zpe.thermalcorrgfe: 0.311593 hartree
zpe.sumelectzpe: -1589.509093 hartree
zpe.sumelectthermal: -1589.480906 hartree
zpe.sumelectthermalent: -1589.479962 hartree
zpe.sumelectthermalfe: -1589.571382 hartree
dipole: -3.0738 12.9526 0.5523
dipole: 13.3238
quadrupole: -109.7562 -184.4971 -240.8597
quadrupole: -1.3449 -3.1702 -0.1411
quadrupole: 68.6148 -6.1261 -62.4887 -1.3449 -3.1702 -0.1411
hfenergy: -1589.8829757 hartree
pointgroup: C01 [X(C25H17Cr1N3O5)]
dipole: 0.5204114 5.210871 -0.2332274 debye
polarizability: 613.9237068|1.7412796|501.2396825|-94.0588267|61.0332921|498.3309488 unknown
InChI: InChI=1S/2C9H7N.C7H3NO4.Cr.O/c2*1-2-4-9-7-10-6-5-8(9)3-1;9-6(10)4-2-1-3-5(8-4)7(11)12;;/h2*1-7H;1-3H;;/q;-1;-3;+4;
charge 0 multiplicity 3
51 atoms
Cr -0.11883019 -1.4414887 0.20433923
O  -2.41414439 -1.44613036 3.50190489
C  -1.96468723 -1.47567743 2.3512289
O  -0.75388427 -1.07318604 2.02057995
C  -2.77092609 -1.94507221 1.17179697
C  -4.10992682 -2.32636202 1.13061022
C  -4.65615743 -2.6685796 -0.11337615
C  -3.8743139 -2.61537029 -1.27377465
C  -2.53956204 -2.23231422 -1.15033475
C  -1.51001824 -2.05792908 -2.23394598
O  -0.35702482 -1.63145659 -1.79453593
O  -1.76624642 -2.28655066 -3.42770232
N  -2.03946422 -1.926271 0.05129033
H  -4.70320517 -2.34614015 2.03710692
H  -5.69652652 -2.96724975 -0.17930752
H  -4.28601886 -2.85774916 -2.24642104
N  1.79571787 -0.6094932 0.53713929
C  2.00525637 0.41536648 1.4247991
C  3.23103541 1.01757985 1.56752794
C  4.32819737 0.59362712 0.77021366
C  5.6226579 1.17001549 0.84586761
C  6.63381673 0.70125714 0.03035205
C  6.40319799 -0.3556121 -0.88877444
C  5.1568212 -0.93705635 -0.98471978
C  4.09902201 -0.47269306 -0.15746887
C  2.80233083 -1.03332162 -0.22134859
H  1.14489819 0.71899764 2.00883096
H  3.35684391 1.8209706 2.28570255
H  5.80196277 1.97859902 1.54770918
H  7.62302126 1.14474236 0.08929244
H  7.21691382 -0.70348245 -1.51699611
H  4.96613336 -1.74671649 -1.68280111
H  2.59054444 -1.84674976 -0.90857678
N  -0.60890309 0.71111956 -0.28613292
C  0.06015393 1.27567452 -1.3447167
C  -0.08522449 2.5938229 -1.70119522
C  -0.95772683 3.43486661 -0.96034333
C  -1.16748919 4.80735995 -1.25447095
C  -2.02964499 5.55424325 -0.47617509
C  -2.71603587 4.97073309 0.62072962
C  -2.53349212 3.6391356 0.92967639
C  -1.65175751 2.84852821 0.14500347
C  -1.426316 1.4781582 0.42604507
H  0.72072786 0.61184631 -1.88966322
H  0.46833576 2.99031744 -2.54620593
H  -0.64257182 5.25545479 -2.09272547
H  -2.18795206 6.60437107 -0.70202174
H  -3.38696855 5.58162723 1.21625867
H  -3.05251825 3.18089806 1.76651292
H  -1.93785361 1.01665172 1.2647845
O  0.47065799 -2.97201494 0.33244175
