program: Gaussian 09
title: /home/michael/molsimp_comfiles/Cr_31a_23_OH/Cr_31a_23_OH.com auto generated
version: ES64L-G09RevE.01
frameworkgroup: C1[X(C25H19CrN4O3)]
method: UTPSSh
basis: Gen
operation: Freq
keyword: #P
keyword: Geom=AllCheck
keyword: Guess=TCheck
keyword: SCRF=Check
keyword: GenChk
keyword: UTPSSh/ChkBas
keyword: Freq
title: /home/michael/molsimp_comfiles/Cr_31a_23_OH/Cr_31a_23_OH.com auto gene
converged: YES YES NO YES
polarizability: 6.23473765e+02 3.17577956e+01 5.85254070e+02 8.90410482e+00 -5.22316661e+01 3.80175136e+02
1716.lowfreq: -13.9763 -8.6072 0.0006 0.0007 0.0009 11.7786 22.5230 30.2911 31.3293
frequency: 22.3229 29.4487 31.1884 40.0719 50.8075 64.4416 75.6375 88.2042 105.2636 110.1183 119.4663 145.1660 146.2778 162.3870 169.8183 177.1733 180.7128 187.7795 194.7314 234.3429 249.7920 254.7400 272.3119 291.0867 312.4681 341.4365 368.8448 384.9756 394.4680 396.1187 403.4376 428.6288 439.1803 455.2976 463.4813 475.2071 490.6113 506.3546 523.8212 539.5110 570.6595 579.4161 628.5490 642.7341 646.3919 651.1178 655.0537 665.7218 692.6394 709.9666 726.1887 759.4190 764.3317 767.1192 770.0241 776.1273 779.1920 788.4241 801.1923 828.8038 848.5365 851.4976 854.0074 884.7343 890.9243 896.2566 922.1146 947.7059 953.7493 964.3367 973.1278 983.3267 992.4017 1004.9969 1013.4471 1018.3845 1026.5505 1029.5819 1030.7769 1032.7963 1035.3454 1040.0252 1048.7395 1050.4007 1066.8806 1075.3170 1090.0420 1104.6790 1105.3715 1112.1576 1142.3193 1157.1181 1171.8863 1172.6646 1175.9127 1182.6503 1198.2149 1204.7458 1241.5729 1249.1894 1280.7200 1285.8504 1296.9937 1321.9419 1323.0891 1328.8247 1363.2185 1378.3939 1385.0688 1392.7782 1411.8668 1431.8393 1443.4733 1474.7002 1478.1302 1488.0544 1494.3430 1497.6894 1527.0506 1534.0185 1543.0617 1607.8139 1611.1147 1620.0903 1622.9071 1640.8656 1643.3158 1649.3143 1652.2650 1656.3398 1671.6214 3201.1814 3205.6645 3215.3183 3217.2473 3218.4439 3219.6627 3225.6146 3225.9397 3227.9811 3230.6948 3233.2443 3238.6308 3240.3696 3243.5733 3245.5179 3248.1046 3248.5165 3251.1491 3253.3039
redmass: 6.1121 5.3936 5.9067 4.4293 5.2857 5.4072 5.7095 6.1167 6.0957 6.5390 5.8725 6.7457 7.5411 5.3341 6.9028 6.3823 5.3531 8.1431 3.8910 7.0927 7.4227 7.1239 6.0889 9.3763 10.7187 13.3908 5.8339 6.6368 3.0441 2.8317 8.5109 3.9091 3.7184 4.1874 4.3998 2.8562 3.4477 8.3409 6.8168 7.8225 5.4268 5.1199 6.8878 6.6736 5.7847 4.3206 6.3020 6.9962 8.0515 1.8162 5.6321 1.9694 1.2327 1.7411 7.5313 1.8503 3.7355 4.7454 2.1895 6.1495 16.1048 2.3079 1.3728 7.5350 1.4136 1.2469 1.3138 1.4807 1.4024 4.8211 1.3023 1.3154 1.3760 1.3935 1.3596 1.3038 7.4780 1.3278 1.3222 1.3656 6.8852 2.3665 5.7767 6.6518 2.6122 3.6814 1.6871 2.0154 1.9233 1.6329 1.9094 1.4896 1.0878 2.1904 1.1133 1.1389 1.3849 1.3912 1.2422 2.1513 1.6608 3.4314 1.8290 7.2831 3.7457 1.9909 3.2414 3.5058 4.8100 1.2127 1.7230 7.4913 2.5223 2.4697 2.2414 2.7192 2.0677 2.1447 1.8977 3.2615 3.2524 6.2790 6.0689 6.1868 5.1521 5.1232 5.9443 6.2530 5.1013 11.4929 6.0053 1.0868 1.0892 1.0951 1.0879 1.0923 1.0905 1.0982 1.0879 1.0892 1.0930 1.0899 1.0958 1.0914 1.0995 1.0945 1.0944 1.0950 1.0976 1.0976
irintensity: 4.9962 1.4283 8.2628 1.0930 0.1424 0.5907 3.4775 3.0391 2.4562 2.9163 5.5194 1.5120 3.9479 0.0393 7.6172 3.5063 2.7448 12.3685 1.0355 17.3672 2.6991 17.8294 8.2051 25.6881 70.2309 91.3345 27.6464 39.3074 1.7374 3.1192 80.7786 29.1385 2.6555 14.6414 2.7384 12.3268 28.6128 12.6494 0.1878 17.2580 3.2409 3.1399 9.9772 19.0828 30.4477 4.8708 0.8254 25.9510 72.2347 98.8683 41.4290 4.8522 35.0561 37.6057 71.3562 123.7895 4.4390 1.5328 43.1560 17.5460 312.4379 13.2679 98.5182 47.0732 18.2543 0.7827 0.4042 9.2974 0.1343 11.6387 2.4013 3.8580 2.0150 1.2971 3.2193 0.0480 27.0132 0.0642 0.4159 0.5523 16.1982 13.5700 13.9294 45.9464 75.9602 10.8908 33.1864 35.1431 22.6369 18.8588 40.4196 3.3594 13.3677 196.7770 7.1510 2.0402 29.5376 75.8036 15.6966 11.5617 2.8345 294.2409 16.6186 6.8577 39.2795 19.8024 83.2615 2.1094 99.3736 5.2436 42.5961 50.8361 0.9588 4.8491 81.7403 109.2982 28.5165 128.1813 4.4257 18.7971 18.8430 4.8274 8.6587 20.5294 18.8747 38.4841 143.7837 308.2923 65.4061 1052.9051 102.6568 1.4379 0.5137 28.3084 2.4620 2.4435 3.1538 30.6830 2.4682 4.2114 3.4912 3.5115 23.4972 0.0675 6.0727 0.5418 0.6016 5.1677 0.2057 6.8394
temp: 298.150 k
press: 1.00000 atm
elementType: 24 8 6 8 6 6 6 6 6 6 6 6 6 6 7 7 1 1 1 1 1 1 1 7 6 6 6 6 6 6 6 6 6 1 1 1 1 1 1 1 7 6 6 6 6 6 1 1 1 1 1 8
symmnumber: 1
zpe: 1039085.9 jmol-1
zpe.correction: 0.395767 hartree
zpe.thermalcorrener: 0.422975 hartree
zpe.thermalcorrenthalpy: 0.423919 hartree
zpe.thermalcorrgfe: 0.336149 hartree
zpe.sumelectzpe: -1494.817904 hartree
zpe.sumelectthermal: -1494.790696 hartree
zpe.sumelectthermalent: -1494.789752 hartree
zpe.sumelectthermalfe: -1494.877521 hartree
dipole: -5.4948 13.4832 10.2890
dipole: 17.8284
quadrupole: -70.9191 -171.2471 -179.3849
quadrupole: -2.3746 -4.1841 -14.8609
quadrupole: 69.5979 -30.7300 -38.8679 -2.3746 -4.1841 -14.8609
hfenergy: -1495.2136707 hartree
pointgroup: C01 [X(C25H19Cr1N4O3)]
dipole: 1.5145026 -5.5969762 3.9471003 debye
polarizability: 630.9419016|27.4294161|574.8666709|-32.6668901|47.1555054|383.0943986 unknown
InChI: InChI=1S/C11H7N2O2.C9H7N.C5H5N.Cr.O/c14-11(15)10-6-3-5-9(13-10)8-4-1-2-7-12-8;1-2-4-9-7-10-6-5-8(9)3-1;1-2-4-6-5-3-1;;/h1-7H;1-7H;1-5H;;/q-3;-1;;+4;
charge 1 multiplicity 3
52 atoms
Cr -0.08972215 -0.15338235 -0.43152846
O  1.47304215 3.52389461 -0.68316671
C  1.27320137 2.31336356 -0.54437666
O  0.08680308 1.78314504 -0.32086683
C  2.37691792 1.29476871 -0.57420857
C  3.74230101 1.5389124 -0.66045016
C  4.60460588 0.43706336 -0.59778607
C  4.0953654 -0.85358776 -0.44289008
C  2.70753817 -1.02859439 -0.37376417
C  1.96493535 -2.28595369 -0.20316111
C  2.54610427 -3.54800094 -0.08307919
C  1.71869393 -4.66232955 0.06542394
C  0.33544322 -4.48859554 0.08347844
C  -0.18247729 -3.19977863 -0.03960516
N  0.61256009 -2.1261501 -0.16820607
N  1.90018683 0.0453746 -0.45343287
H  4.11239676 2.55187557 -0.7626531
H  5.67696898 0.5851491 -0.65853403
H  4.76308629 -1.703916 -0.37622305
H  3.62366154 -3.65624161 -0.10694921
H  2.15269201 -5.65157734 0.15988839
H  -0.34119518 -5.32841891 0.18648812
H  -1.25020925 -3.01469623 -0.04130317
N  -2.19219428 0.00209215 -0.1891613
C  -3.02285161 -0.87235385 -0.84443122
C  -4.38879846 -0.82190609 -0.71522376
C  -4.98685576 0.17069524 0.10586362
C  -6.3880759 0.29719508 0.28941071
C  -6.88825913 1.29544201 1.10180514
C  -6.02160693 2.20542775 1.76229775
C  -4.65550118 2.10762542 1.60481774
C  -4.11466015 1.08862364 0.7749432
C  -2.72044046 0.94154024 0.59050234
H  -2.53212849 -1.60151911 -1.47722002
H  -5.0079337 -1.5377012 -1.24573972
H  -7.05297377 -0.39673063 -0.21556917
H  -7.96077557 1.39013749 1.24092331
H  -6.44340231 2.98010169 2.39453259
H  -3.98100166 2.79621287 2.10481585
H  -2.02990489 1.6114333 1.09275992
N  -0.06154486 -0.23327568 1.82951088
C  -0.91446683 -1.05772895 2.47642257
C  -0.94877552 -1.1690389 3.86312163
C  -0.06913775 -0.39683718 4.62467918
C  0.81151671 0.45974427 3.96314091
C  0.78360595 0.51193315 2.57158001
H  -1.58920685 -1.64000108 1.85845767
H  -1.65521476 -1.84761656 4.32767775
H  -0.07189835 -0.46032664 5.70788858
H  1.51254967 1.0832287 4.50640338
H  1.45424086 1.17316486 2.03593171
O  -0.29709436 -0.4708559 -2.03115444
