program: Gaussian 09
title: /home/michael/molsimp_comfiles/Mn_3a1_19_OH/Mn_3a1_19_OH.com auto generated
version: ES64L-G09RevE.01
frameworkgroup: C1[X(C27H19MnN6O3)]
method: UTPSSh
basis: Gen
operation: Freq
keyword: #P
keyword: Geom=AllCheck
keyword: Guess=TCheck
keyword: SCRF=Check
keyword: GenChk
keyword: UTPSSh/ChkBas
keyword: Freq
title: /home/michael/molsimp_comfiles/Mn_3a1_19_OH/Mn_3a1_19_OH.com auto gene
converged: YES YES NO YES
polarizability: 6.65225701e+02 -2.28116133e-02 7.05042054e+02 -8.22523280e-02 7.47067158e-02 5.13334232e+02
1716.lowfreq: -10.3912 -7.9154 -0.0003 0.0010 0.0010 6.0545 20.7221 22.5485 31.2239
frequency: 20.3775 22.5310 31.0173 34.2583 36.4905 48.3464 58.9173 73.4349 105.1695 108.8299 113.0466 113.4028 139.0339 164.6637 171.3939 175.9872 181.2073 184.6657 202.8834 209.2904 210.0214 242.5808 265.7243 270.0942 286.1220 302.7486 310.0358 315.0132 360.8634 390.3651 392.6438 395.5776 403.7561 407.5447 426.5259 444.9658 461.2277 476.5765 477.1919 492.2740 495.0394 503.1899 532.2427 532.5170 538.6193 538.9214 571.7624 573.9764 636.3597 637.4253 645.0761 661.8736 662.3827 664.8192 691.5534 721.9228 758.1581 766.3706 766.7438 771.3010 775.6805 782.9700 783.0527 793.2597 793.5078 798.9464 841.8952 843.4501 847.3880 856.6811 857.2516 864.3544 880.3405 895.1015 895.1202 922.7122 952.9814 973.4305 974.0602 989.0807 989.2223 999.3340 999.4359 1005.7079 1025.4025 1026.2205 1026.2220 1031.8840 1033.7198 1033.7347 1036.0178 1048.0202 1062.2357 1096.4619 1097.3061 1100.2118 1106.5197 1140.6588 1155.8034 1155.9782 1170.5667 1172.5739 1172.6119 1180.8211 1182.8123 1183.1252 1201.8303 1245.1530 1246.8101 1284.6304 1285.4466 1285.5286 1310.9184 1311.8916 1312.5809 1320.8054 1336.5898 1337.8543 1357.8345 1388.5610 1439.0228 1439.1288 1443.3898 1453.7698 1454.5568 1479.4963 1483.5930 1484.0093 1491.9022 1524.6704 1538.3405 1538.4925 1582.7413 1584.3548 1607.7305 1620.1765 1620.7075 1621.0433 1637.2197 1645.3550 1650.3359 1660.9988 1661.0491 3212.3861 3212.3868 3219.8722 3219.8806 3228.0159 3228.0200 3230.8809 3232.0102 3232.3009 3232.3097 3234.5678 3235.2232 3235.2539 3242.8890 3248.7915 3252.1374 3252.3089 3287.4083 3288.1376
redmass: 5.5179 6.9127 4.7806 5.7622 5.0444 5.7188 7.1376 6.7826 4.4219 7.2832 6.5337 6.6059 7.3217 5.0672 7.3422 6.8707 4.3075 4.8799 7.2285 8.1824 9.5664 6.6441 8.4408 5.6716 7.1024 12.8868 15.0938 11.0169 9.2756 3.6654 3.6847 4.4806 5.3346 7.1606 3.6420 4.1571 4.2079 3.1172 3.0880 3.6960 3.9587 7.6640 7.1380 7.0552 8.0316 8.1473 4.0765 7.0849 7.3919 7.3927 7.1713 4.6127 6.7957 4.7471 7.9411 5.6456 2.1365 1.3509 1.3474 9.2078 1.9657 5.4601 5.5680 3.4858 3.5440 1.9150 6.1289 5.8247 2.2865 1.3872 1.3202 10.2684 7.7432 1.5051 1.5057 1.3270 1.3988 5.4315 5.4027 1.3201 1.3200 1.3540 1.3543 1.3846 7.4843 1.3179 1.3180 1.3389 2.3117 2.3114 1.3432 6.2220 3.0164 3.2371 3.2091 2.4434 1.7747 1.7521 1.5425 1.5362 2.2942 1.2361 1.2268 1.1645 1.3153 1.3151 1.3371 2.9769 2.9941 2.8571 1.7671 1.7835 1.6226 2.7040 2.6966 7.2360 3.1031 3.0562 3.0851 4.8556 5.7278 5.6319 2.6710 2.0615 2.0686 2.3610 2.4171 2.4020 2.6873 3.3393 3.1077 3.1083 6.6006 6.6372 5.5221 7.1029 5.9538 5.9856 6.3264 7.7711 8.4670 5.6581 5.6615 1.0873 1.0873 1.0896 1.0896 1.0957 1.0957 1.0896 1.0902 1.0932 1.0932 1.0917 1.0986 1.0986 1.0950 1.0932 1.0986 1.0976 1.0931 1.0932
irintensity: 0.0029 10.7719 0.0079 1.6762 2.2628 7.0436 0.5983 2.3951 6.4296 7.3363 0.3253 0.0020 0.1432 0.0667 16.9183 12.0117 1.2426 12.3564 0.8797 1.6127 9.5910 6.2983 24.8750 10.0385 32.0236 148.7975 194.7110 22.0036 1.4952 0.6655 4.5144 12.2330 4.9067 70.9605 12.1530 39.8739 5.9564 0.1041 19.5427 0.2426 4.3755 11.4854 0.0954 1.6803 0.3041 31.1353 0.1416 4.9399 14.2439 8.3980 30.4501 1.0211 13.1444 0.8587 52.0752 52.6818 1.5236 0.1678 83.7605 52.7922 89.1593 39.9309 1.9624 0.0132 21.9604 41.9466 3.3006 9.0800 9.7962 293.4936 0.3012 289.1757 51.8210 0.4162 10.9375 0.1713 0.0000 2.4786 0.3016 0.0025 1.0062 0.0144 6.5335 1.4440 62.5804 0.0011 0.0062 0.0670 8.0158 6.2062 0.1165 36.9924 10.5038 25.7179 3.6493 54.3775 21.3579 34.6740 4.3082 14.3297 228.9688 7.3174 10.8932 5.6489 3.4298 1.5730 75.7804 0.0303 16.5952 252.0262 0.1845 3.6180 47.5057 2.4150 51.9375 27.9361 5.2412 32.2401 124.4053 120.5115 110.6094 56.7271 0.2937 1.5527 33.7133 23.9019 3.7932 22.3588 231.4330 39.8878 41.8476 1.2004 72.9760 3.1657 8.3143 28.5132 0.0270 87.9222 164.4707 992.3783 360.5430 8.7884 1.1280 0.5985 0.0699 1.1890 6.9779 25.0427 3.3876 13.2171 3.5854 1.1810 1.0903 2.1062 18.3201 16.8452 0.1842 0.2566 3.9397 0.4125 21.6981 1.2890
temp: 298.150 k
press: 1.00000 atm
elementType: 25 8 6 8 6 6 6 6 6 6 6 6 6 6 7 7 1 1 1 1 1 1 1 8 7 6 6 6 6 6 6 6 6 7 1 1 1 1 1 1 7 6 6 6 6 6 6 6 6 7 1 1 1 1 1 1
symmnumber: 1
zpe: 1095565.4 jmol-1
zpe.correction: 0.417279 hartree
zpe.thermalcorrener: 0.446838 hartree
zpe.thermalcorrenthalpy: 0.447782 hartree
zpe.thermalcorrgfe: 0.354151 hartree
zpe.sumelectzpe: -1698.050052 hartree
zpe.sumelectthermal: -1698.020493 hartree
zpe.sumelectthermalent: -1698.019549 hartree
zpe.sumelectthermalfe: -1698.113180 hartree
dipole: -0.0023 22.1580 1.1260
dipole: 22.1866
quadrupole: -62.4388 -143.9888 -200.6778
quadrupole: -0.0099 0.0003 12.0948
quadrupole: 73.2630 -8.2870 -64.9760 -0.0099 0.0003 12.0948
hfenergy: -1698.4673307 hartree
pointgroup: C01 [X(C27H19Mn1N6O3)]
dipole: 5.0983232 7.0832599 -0.1671037 debye
polarizability: 570.0913185|87.2814058|648.5762043|5.3254771|-4.2270386|664.9344641 unknown
InChI: InChI=1S/C11H7N2O2.2C8H6N2.Mn.O/c14-11(15)10-6-3-5-9(13-10)8-4-1-2-7-12-8;2*1-2-4-8-7(3-1)5-6-9-10-8;;/h1-7H;2*1-6H;;/q-3;2*-1;+5;
charge 1 multiplicity 4
56 atoms
Mn -0.1458191 0.20106773 -0.17705791
O  1.72712845 -3.3302812 -0.29631457
C  1.42252872 -2.13213223 -0.27108525
O  0.1767936 -1.70416438 -0.21006168
C  2.44951696 -1.03354633 -0.30780279
C  3.83453544 -1.15504306 -0.37226563
C  4.58711392 0.02715867 -0.39549814
C  3.96329354 1.27835011 -0.35507246
C  2.56572002 1.32017766 -0.29075481
C  1.67851125 2.49983749 -0.23875717
C  2.10661295 3.82452423 -0.2454911
C  1.15310475 4.84484637 -0.19189842
C  -0.20134809 4.51814192 -0.13305027
C  -0.57077803 3.17391113 -0.12918473
N  0.34332451 2.1915165 -0.18062387
N  1.87064203 0.17129417 -0.26995848
H  4.30383642 -2.13096161 -0.40293013
H  5.66896076 -0.02548483 -0.44547216
H  4.54848129 2.18985101 -0.37317439
H  3.16513845 4.05227266 -0.29176066
H  1.47009103 5.88184625 -0.19631079
H  -0.96751665 5.2828865 -0.09052564
H  -1.60426349 2.84968019 -0.0849984
O  -1.79926681 0.41480516 -0.09864368
N  -0.02941426 0.13079413 1.89869201
C  0.71305454 0.96884766 2.67381588
C  0.72065456 0.86209863 4.04854845
C  -0.05595162 -0.14276347 4.65111433
C  -0.14139826 -0.36952633 6.04975354
C  -0.93720536 -1.38939042 6.52366134
C  -1.67652965 -2.21987451 5.63432991
C  -1.61739314 -2.02684393 4.27362368
C  -0.80290133 -0.98099846 3.75820186
N  -0.77079911 -0.81515109 2.4094488
H  1.29023351 1.72446858 2.16113914
H  1.31753847 1.54559264 4.64232664
H  0.42369463 0.26581035 6.72380935
H  -1.00657225 -1.56877861 7.59164339
H  -2.2929458 -3.01412274 6.04209135
H  -2.17349301 -2.64866924 3.58036741
N  -0.22119595 0.17058494 -2.25557149
C  0.44751383 1.02393354 -3.07964341
C  0.32809944 0.94365941 -4.45100281
C  -0.50183891 -0.0499922 -4.99857405
C  -0.71620889 -0.24985616 -6.38746107
C  -1.55322485 -1.26115293 -6.80544108
C  -2.20801519 -2.10929537 -5.86782824
C  -2.0234045 -1.94242356 -4.51492286
C  -1.16396983 -0.90589806 -4.05684097
N  -1.00743873 -0.76596235 -2.71386488
H  1.07043494 1.76990781 -2.60801207
H  0.86840902 1.63885331 -5.08407165
H  -0.21517455 0.39884601 -7.09843364
H  -1.72102048 -1.42001977 -7.8657169
H  -2.86011122 -2.8961167 -6.23217759
H  -2.51369396 -2.57798122 -3.78540221
