program: Gaussian 09
title: /home/michael/molsimp_comfiles/Mn_31a_2_OH/Mn_31a_2_OH.com auto generated
version: ES64L-G09RevE.01
frameworkgroup: C1[X(C32H25MnN6O)]
method: UTPSSh
basis: Gen
operation: Freq
keyword: #P
keyword: Geom=AllCheck
keyword: Guess=TCheck
keyword: SCRF=Check
keyword: GenChk
keyword: UTPSSh/ChkBas
keyword: Freq
title: /home/michael/molsimp_comfiles/Mn_31a_2_OH/Mn_31a_2_OH.com auto genera
converged: YES YES NO YES
polarizability: 7.62876672e+02 -1.24188726e+01 6.04754852e+02 -5.94037843e+01 4.08064942e+01 6.41476493e+02
1716.lowfreq: -10.9653 -2.7260 -0.0002 0.0006 0.0008 12.4936 17.0460 20.8621 25.2365
frequency: 16.1869 17.9692 20.6310 31.7673 38.0672 46.1758 47.5485 79.1849 90.0948 93.3739 96.6893 101.0942 107.7818 116.0511 121.0505 131.6608 153.2577 170.0742 182.6689 195.7991 210.3372 213.7592 228.6683 232.4965 234.7995 245.6092 263.2739 271.7334 288.2184 314.1574 352.9325 376.3414 385.2520 391.2457 393.4370 415.3004 419.4164 425.4088 440.9181 453.5891 458.2647 472.3080 481.1834 487.9661 489.9351 517.9706 525.3098 530.6469 531.3011 534.1209 545.4722 605.4352 627.7431 639.6399 639.7880 642.2217 644.4532 648.2040 652.4031 660.9707 661.7444 730.3021 742.3807 751.6960 760.0104 764.5032 765.3626 776.9368 784.0011 784.8322 789.9083 794.0582 804.0020 834.8226 836.9786 840.1583 842.0335 849.3670 862.1408 891.8089 895.4349 912.9922 918.7528 940.9460 942.1388 967.8210 974.7864 977.6985 983.9078 990.2956 992.9440 994.5131 995.4760 1001.1085 1019.4562 1021.2415 1024.6812 1025.9302 1027.3932 1029.0305 1029.1312 1031.8069 1033.3497 1040.9745 1050.9074 1063.0013 1076.6442 1093.4597 1096.1798 1119.3937 1127.9446 1139.9757 1157.8770 1158.2273 1161.0333 1173.2159 1177.7370 1180.2096 1180.5235 1185.8238 1206.6967 1216.8799 1250.9083 1252.5370 1285.1446 1285.2836 1299.9948 1308.0649 1311.2226 1312.0938 1318.8764 1330.2699 1340.2776 1342.9874 1359.1036 1367.2804 1379.5942 1420.8573 1433.5448 1435.5242 1441.5027 1452.7011 1471.8829 1476.7695 1483.5126 1484.9449 1492.6253 1500.2467 1512.0502 1530.5166 1536.9270 1544.0457 1584.8583 1608.1785 1609.8970 1615.7098 1620.5191 1625.6730 1636.4658 1641.5106 1643.5159 1647.4028 1661.8638 1669.8481 3203.8491 3208.5385 3213.8928 3218.2641 3218.2959 3220.5836 3222.4688 3224.4950 3225.7910 3227.3737 3228.5412 3228.6954 3229.0491 3230.9087 3235.9685 3241.0792 3242.2671 3245.0977 3245.3848 3247.4871 3252.9572 3253.9169 3254.9344 3256.4449 3500.1857
redmass: 5.9232 5.8710 4.9284 5.0264 5.2191 5.1563 4.7951 4.7875 5.1765 6.1546 7.4767 5.2317 5.7068 4.8127 6.4706 6.1015 6.3703 6.9785 4.0297 3.7195 6.5716 5.7110 5.8073 6.4428 8.3047 5.6374 7.3597 8.0335 7.9277 7.9243 6.5892 4.2463 3.2707 3.1295 4.5119 3.6096 3.8818 5.3608 4.1540 3.8902 1.3383 2.7924 2.9215 3.4359 2.3518 3.3144 6.5509 5.1548 6.8810 8.0507 7.6713 15.3966 7.4324 6.2941 7.0809 4.3801 6.1572 3.8602 7.0171 6.8714 4.8089 6.7206 3.5217 2.2913 2.0018 1.2254 1.3457 3.6403 1.2348 5.5926 4.7556 3.4197 2.0670 6.1312 5.7092 4.1126 2.7127 1.3370 1.3050 1.3972 1.5110 1.3183 1.2938 1.4734 1.4351 5.0885 4.1887 1.1681 1.3066 1.3289 1.3676 1.3866 1.3757 1.3579 7.4665 1.3094 1.3334 7.3746 1.3230 1.3592 1.3249 6.6266 2.3131 2.3884 6.4110 2.6775 2.4945 2.0356 2.7269 1.7601 1.6124 1.6630 1.5210 1.4888 1.6873 1.2290 1.1083 1.1769 1.2803 1.1322 1.4093 1.2841 2.8408 2.2200 1.7269 1.7338 1.8621 2.4430 2.1077 2.7615 1.5068 8.7857 3.4102 3.0740 3.3341 5.0386 3.7194 1.6449 6.6733 2.3396 4.6637 2.2743 2.2168 2.5879 2.3977 2.0650 2.7653 2.0130 2.5233 2.8605 3.1002 3.0897 6.6760 6.1107 5.8664 5.8439 5.5377 6.3849 4.8949 5.4071 4.9267 6.3523 5.6535 5.8844 1.0869 1.0893 1.0874 1.0908 1.0949 1.0895 1.0882 1.0907 1.0907 1.0983 1.0909 1.0957 1.0909 1.0921 1.0988 1.0951 1.0936 1.0921 1.0975 1.0985 1.0924 1.0952 1.0966 1.0956 1.0669
irintensity: 0.1472 0.1900 0.6696 0.8582 1.2796 3.7977 0.6436 0.7668 1.4320 1.9636 0.9486 0.4764 7.3649 1.0375 0.4242 2.5685 3.8113 1.4642 3.9838 3.1461 15.4380 14.1288 8.8742 20.6486 26.4398 5.1753 36.3253 48.2344 24.9599 62.7617 1.7422 0.9884 10.5476 1.5466 6.8930 11.5489 0.6117 0.8371 10.1179 0.6144 174.6118 13.2362 11.2842 19.3481 32.3831 6.5148 0.9547 1.7652 3.4627 16.6768 0.5569 414.7152 2.3107 26.6164 15.8790 2.1529 32.9369 9.8421 25.2953 18.9606 4.2852 1.2372 22.8938 0.1997 2.5468 31.8063 56.0142 4.5573 237.0173 29.6178 1.9479 14.2199 3.6578 18.0347 8.7787 1.7597 4.1413 85.2356 84.0079 20.7055 11.9785 0.0258 0.3779 7.3074 3.0015 12.4984 26.7825 173.9081 2.2449 2.0752 2.3621 0.8075 0.3862 2.7769 9.5988 0.0260 0.4969 37.8178 0.0044 1.4791 0.1219 37.9979 7.8976 13.4058 1.7622 109.5412 7.3417 23.3160 39.7571 13.4231 6.6284 5.1098 11.7381 3.5397 0.3845 12.0265 7.8296 9.3110 6.4391 20.7753 22.0249 23.5209 4.9656 12.8897 1.1759 0.7279 23.1915 0.8660 30.6737 12.3700 1.5551 17.6815 99.3783 23.2119 8.4494 32.8961 3.4582 44.2571 73.5664 3.9793 76.6732 24.9846 70.2544 15.3376 25.1606 173.6487 28.0739 23.9654 143.3875 17.9091 12.2219 14.5169 16.5652 6.8799 40.3367 59.0906 48.9972 83.1459 56.6354 91.7095 29.9767 2.7902 5.5129 124.8757 0.7760 1.1591 0.2690 13.4577 17.8766 2.6533 6.8779 4.2647 3.2995 27.1100 0.2597 12.3010 9.5661 1.1437 16.9542 7.8396 3.4840 5.0263 5.4238 5.4231 1.9847 3.8291 4.1689 0.9589 691.9714
temp: 298.150 k
press: 1.00000 atm
elementType: 25 6 6 6 6 6 6 6 6 6 6 6 6 6 6 7 7 7 6 1 1 1 1 1 1 1 1 1 1 1 7 6 6 6 6 6 6 6 6 7 1 1 1 1 1 1 7 6 6 6 6 6 6 6 6 6 1 1 1 1 1 1 1 8 1
symmnumber: 1
zpe: 1331187.4 jmol-1
zpe.correction: 0.507022 hartree
zpe.thermalcorrener: 0.539755 hartree
zpe.thermalcorrenthalpy: 0.540699 hartree
zpe.thermalcorrgfe: 0.439401 hartree
zpe.sumelectzpe: -1741.590998 hartree
zpe.sumelectthermal: -1741.558265 hartree
zpe.sumelectthermalent: -1741.557321 hartree
zpe.sumelectthermalfe: -1741.658619 hartree
dipole: -1.2300 4.9390 -1.2782
dipole: 5.2479
quadrupole: -85.7821 -167.7017 -141.2733
quadrupole: 26.3210 -11.5886 12.1137
quadrupole: 45.8036 -36.1160 -9.6876 26.3210 -11.5886 12.1137
hfenergy: -1742.0980208 hartree
pointgroup: C01 [X(C32H25Mn1N6O1)]
dipole: -0.4791283 0.2371134 1.9942775 debye
polarizability: 733.5939927|44.876077|663.8313622|67.8855351|42.8090855|611.6826614 unknown
InChI: InChI=1S/C15H11N3.C9H7N.C8H6N2.Mn.H2O/c1-3-10-16-12(6-1)14-8-5-9-15(18-14)13-7-2-4-11-17-13;1-2-4-9-7-10-6-5-8(9)3-1;1-2-4-8-7(3-1)5-6-9-10-8;;/h1-11H;1-7H;1-6H;;1H2/q3*-1;+4;/p-1
charge 2 multiplicity 5
65 atoms
Mn -0.06925632 -0.13407358 0.09231811
C  -0.03835635 4.41593419 -0.35105588
C  1.31723816 4.69527408 -0.51985294
C  2.2435407 3.65833935 -0.41134131
C  1.78661087 2.36478303 -0.13917048
C  2.697295 1.20303307 0.00072563
C  4.09250096 1.31224559 0.04011033
C  4.85113624 0.15247946 0.18523317
C  4.21837813 -1.08601221 0.27453862
C  2.82133361 -1.13061718 0.21993667
C  2.03611114 -2.38514123 0.26263755
C  2.61024217 -3.65942154 0.31584515
C  1.77477989 -4.77671844 0.32622077
C  0.39172979 -4.59972019 0.27483473
C  -0.10834419 -3.30001159 0.22055555
N  0.69496676 -2.22443233 0.22044027
N  2.09574074 0.00042807 0.10076618
N  0.46700802 2.09637056 0.01459976
C  -0.41880265 3.10059219 -0.08852892
H  -0.79221331 5.19104325 -0.42471197
H  1.65374743 5.70374616 -0.73489136
H  3.30004819 3.85518786 -0.5444547
H  4.57675059 2.27776937 -0.03138582
H  5.93307503 0.21337446 0.22676329
H  4.80009128 -1.99238091 0.38400859
H  3.68579614 -3.78298149 0.34266913
H  2.20296109 -5.77242346 0.36843352
H  -0.28968122 -5.44238891 0.27394195
H  -1.17461067 -3.10500833 0.17196361
H  -1.46348174 2.84195336 0.0421452
N  -2.21672428 0.24408187 0.01274954
C  -2.95668765 0.80340004 1.00755498
C  -4.32393404 0.95974343 0.89336408
C  -4.95561893 0.52014506 -0.28316116
C  -6.35022552 0.61286999 -0.53206966
C  -6.857881 0.15524137 -1.72791652
C  -6.00737658 -0.40844801 -2.72179108
C  -4.65165937 -0.51270806 -2.51569485
C  -4.1028273 -0.04948491 -1.28851623
N  -2.76217437 -0.16590028 -1.10835332
H  -2.40707577 1.12854151 1.88117151
H  -4.89042913 1.41560498 1.69798675
H  -6.99407498 1.04421951 0.22732412
H  -7.92306993 0.22278699 -1.92336855
H  -6.44219544 -0.75839157 -3.65208031
H  -3.98790646 -0.93878535 -3.26024767
N  -0.13443775 -0.09656682 2.16926141
C  -0.89576509 -1.05369052 2.80135424
C  -0.98592554 -1.13136607 4.16792558
C  -0.27895777 -0.20523372 4.98043853
C  -0.31629702 -0.21572934 6.39774436
C  0.39979121 0.72604735 7.11065741
C  1.17852215 1.7114732 6.44943205
C  1.23512277 1.74792398 5.07259492
C  0.50703459 0.79014099 4.31602272
C  0.53597035 0.78950224 2.90396827
H  -1.43023417 -1.73964932 2.15554336
H  -1.60011111 -1.90118299 4.62250265
H  -0.91082754 -0.96730038 6.90744519
H  0.37041204 0.71679119 8.19575338
H  1.73108791 2.4375274 7.0367923
H  1.82664133 2.49498521 4.5520647
H  1.12066692 1.53531067 2.37904709
O  -0.07205605 -0.18835925 -1.71709069
H  -1.01442897 -0.32646409 -1.97128352
