program: Gaussian 09
title: /home/michael/molsimp_comfiles/Mn_3a1_20_OH/Mn_3a1_20_OH.com auto generated
version: ES64L-G09RevE.01
frameworkgroup: C1[X(C28H20MnN5O3)]
method: UTPSSh
basis: Gen
operation: Freq
keyword: #P
keyword: Geom=AllCheck
keyword: Guess=TCheck
keyword: SCRF=Check
keyword: GenChk
keyword: UTPSSh/ChkBas
keyword: Freq
title: /home/michael/molsimp_comfiles/Mn_3a1_20_OH/Mn_3a1_20_OH.com auto gene
converged: YES YES NO NO
polarizability: 7.07133954e+02 6.35595464e+01 6.17375952e+02 2.29319752e+01 -1.09417722e+01 5.57530062e+02
1716.lowfreq: -14.6742 -11.7022 -0.0009 -0.0003 0.0006 3.9068 18.8130 24.3560 33.5429
frequency: 18.5198 24.2379 33.1590 36.3890 44.8715 46.6884 69.6430 81.8299 91.5287 108.2909 119.9760 122.5200 149.8542 158.2029 164.9469 175.6394 180.9906 183.4677 186.4510 206.3305 215.2372 246.6215 261.5107 269.5145 285.8268 305.9696 310.8315 315.5320 358.6600 382.4502 391.2697 394.1865 396.4503 404.1168 430.2616 448.4241 462.5639 474.2195 476.7131 488.7728 493.5774 503.5569 525.1244 532.8549 539.7221 542.9155 566.3069 579.2001 636.8561 640.3910 643.6025 647.9625 661.9343 662.6982 691.8736 723.8161 758.8546 764.3137 765.0814 769.3461 774.1230 775.3689 783.5037 788.6878 792.6563 798.7709 832.6301 840.7982 842.6065 846.6873 861.7409 870.8593 880.5990 889.8942 894.5423 922.8231 943.4136 951.4745 962.3825 973.1936 978.6016 989.4326 990.7784 1001.6480 1007.4733 1020.2541 1023.4878 1029.1073 1029.6716 1032.8260 1034.1132 1039.4442 1050.0503 1066.5903 1067.1880 1094.8639 1100.7834 1109.5369 1139.1369 1155.2647 1156.4389 1164.4422 1171.0320 1176.3257 1181.1360 1188.9458 1202.4675 1204.6671 1246.3205 1251.0640 1281.4816 1281.8017 1285.4678 1292.4463 1312.9656 1316.4239 1319.5532 1336.4707 1357.3270 1375.1631 1388.7753 1411.4858 1433.3181 1440.8200 1445.0796 1453.8448 1474.7321 1484.1120 1484.8764 1490.8267 1495.5067 1526.4590 1538.6469 1545.1522 1584.4943 1605.1144 1608.4235 1620.2344 1620.4750 1638.2840 1640.5565 1646.8222 1653.1841 1661.5157 1669.6196 3203.4807 3208.0612 3210.1039 3216.9960 3217.8023 3225.1799 3226.7146 3227.4708 3229.9185 3231.1478 3231.5871 3232.5436 3234.1133 3241.1683 3245.9079 3247.0833 3250.7222 3252.8213 3271.2684 3296.7538
redmass: 6.1234 6.5785 4.9924 4.2301 5.2092 5.7747 9.3976 6.5548 6.1561 4.5072 7.2116 6.4195 6.6657 10.1604 5.2497 6.4569 4.4434 6.9694 3.8774 6.3627 9.0547 6.1479 8.0764 5.2594 7.3158 13.9316 14.6797 11.1915 8.5705 4.3593 3.5594 3.4757 4.9681 6.5149 3.7300 4.1567 4.2788 2.7740 3.1023 3.6125 3.7642 7.9144 6.8247 7.0703 8.0572 7.8433 5.0398 5.2976 7.3511 6.6933 3.5263 7.1533 4.6732 6.8482 7.9901 5.7073 2.0955 1.2398 1.3421 8.6957 3.6073 1.8862 5.3383 4.6839 3.6119 2.0383 6.1055 1.3644 3.9148 2.6231 1.4072 13.3418 8.6203 1.3998 1.5103 1.3214 1.5211 1.4019 4.9482 5.1626 1.3097 1.3303 1.3750 1.3608 1.3750 1.3070 1.3203 1.6310 3.6920 1.3588 2.2817 2.3584 6.4913 2.8975 2.9335 3.2118 2.5421 1.6660 1.9256 1.5071 1.4876 2.3976 1.2003 1.1115 1.1120 1.3923 1.3492 1.3638 3.1425 2.1429 2.0408 2.1304 1.7764 1.7880 2.6970 1.8568 4.2582 3.0483 3.0552 3.7200 4.7916 1.7627 7.0105 5.6419 2.5723 2.0841 2.5726 2.3740 2.3690 2.5733 2.0182 3.2947 3.0529 3.1845 6.6622 6.4333 5.4467 6.6315 6.3505 6.0902 5.1975 6.4433 10.8959 5.7253 6.1076 1.0868 1.0893 1.0873 1.0895 1.0952 1.0957 1.0920 1.0979 1.0895 1.0925 1.0901 1.0988 1.0932 1.0909 1.0952 1.0935 1.0976 1.0991 1.0933 1.0932
irintensity: 0.6948 4.0707 3.9309 0.6897 2.8116 8.6108 3.6768 2.8752 0.7323 6.3908 2.4994 2.6310 3.0333 16.2604 1.6357 9.2324 11.6907 0.4421 2.6588 5.1549 4.2509 0.6137 23.2916 0.9681 15.8918 168.7569 198.4339 46.7689 0.9276 6.0544 4.0427 3.2831 14.6699 56.1054 13.1507 46.0668 4.1159 15.7900 8.7110 29.9886 0.3090 12.2575 0.0309 0.5747 13.2695 23.8892 2.1668 3.2612 15.2090 18.6767 9.5655 29.4014 0.9846 13.5639 51.2037 57.9914 3.4910 33.5564 47.3458 56.8560 1.3104 100.3945 28.6021 1.0618 9.7841 31.4719 11.8317 89.7285 15.5338 13.5779 89.4650 312.6399 116.4121 12.7330 9.5792 0.4768 11.7618 0.0170 6.9981 2.5858 0.2664 1.8150 5.1076 2.5167 1.4387 0.0290 0.0172 11.2875 38.3057 0.9982 7.8368 13.1778 39.7628 72.1050 56.5807 11.7739 50.8547 37.8794 63.6761 6.3269 2.8438 259.5418 9.1379 7.0641 0.1322 6.9443 62.1346 41.4849 12.4148 11.8782 129.8131 121.6589 8.4884 16.8268 13.4309 46.0119 26.8584 19.1814 106.0133 0.9820 108.3087 50.9391 51.0886 80.7288 1.1396 17.9314 10.8584 5.9386 4.8430 241.7451 19.3556 35.5311 23.5135 13.8922 31.1609 5.2756 7.2370 0.1940 33.6262 127.7038 22.9205 519.6933 937.1620 9.2116 107.5996 1.0533 0.6323 0.1080 3.3147 25.7140 14.9283 7.3815 25.9223 5.7312 5.6448 3.3878 19.0285 0.7875 2.7886 0.2259 0.9477 0.1548 6.4059 14.7455 10.6482
temp: 298.150 k
press: 1.00000 atm
elementType: 25 8 6 8 6 6 6 6 6 6 6 6 6 6 7 7 1 1 1 1 1 1 1 8 7 6 6 6 6 6 6 6 6 7 1 1 1 1 1 1 7 6 6 6 6 6 6 6 6 6 1 1 1 1 1 1 1
symmnumber: 1
zpe: 1128825.0 jmol-1
zpe.correction: 0.429947 hartree
zpe.thermalcorrener: 0.459562 hartree
zpe.thermalcorrenthalpy: 0.460506 hartree
zpe.thermalcorrgfe: 0.367220 hartree
zpe.sumelectzpe: -1682.032261 hartree
zpe.sumelectthermal: -1682.002646 hartree
zpe.sumelectthermalent: -1682.001702 hartree
zpe.sumelectthermalfe: -1682.094988 hartree
dipole: -6.9602 -8.2753 -14.3692
dipole: 17.9833
quadrupole: -83.1615 -190.4132 -167.8418
quadrupole: -14.3040 -1.2355 3.6421
quadrupole: 63.9773 -43.2743 -20.7030 -14.3040 -1.2355 3.6421
hfenergy: -1682.4622081 hartree
pointgroup: C01 [X(C28H20Mn1N5O3)]
dipole: -2.3390761 6.4179914 -1.8429219 debye
polarizability: 702.3023879|-46.5141521|561.2055088|55.7251854|-7.1476199|618.5320714 unknown
InChI: InChI=1S/C11H7N2O2.C9H7N.C8H6N2.Mn.O/c14-11(15)10-6-3-5-9(13-10)8-4-1-2-7-12-8;1-2-4-9-7-10-6-5-8(9)3-1;1-2-4-8-7(3-1)5-6-9-10-8;;/h1-7H;1-7H;1-6H;;/q-3;2*-1;+5;
charge 1 multiplicity 4
57 atoms
Mn 0.08079561 -0.55587694 0.06749759
O  1.1368823 -0.84661102 3.91991421
C  0.74498806 -0.48153657 2.80665319
O  0.52552881 -1.3156972 1.80466749
C  0.4541621 0.95935517 2.48232878
C  0.49326134 2.05697766 3.33745099
C  0.15875968 3.3067262 2.79858053
C  -0.18527468 3.44181161 1.44944906
C  -0.19031771 2.29386681 0.64770986
C  -0.45959486 2.17159838 -0.79864141
C  -0.80364022 3.22544683 -1.64220106
C  -0.99593469 2.97066461 -3.00234333
C  -0.83945318 1.67248465 -3.48708194
C  -0.50438186 0.65624402 -2.59434533
N  -0.31699994 0.90038318 -1.28772326
N  0.11685917 1.10781588 1.19719168
H  0.76971547 1.93987154 4.37839011
H  0.17079877 4.18560485 3.43355615
H  -0.43555403 4.41212816 1.037652
H  -0.91572143 4.22597207 -1.24171118
H  -1.26251563 3.78098564 -3.67195983
H  -0.9764198 1.43817688 -4.53591684
H  -0.37962946 -0.37403661 -2.90538878
O  0.00465111 -1.89821677 -0.92331588
N  -1.96517508 -0.68407822 0.42276905
C  -2.48556714 -0.9123475 1.66063266
C  -3.84344913 -1.05133381 1.85716402
C  -4.69884953 -0.95686686 0.74549441
C  -6.11133501 -1.08558768 0.79928858
C  -6.84660607 -0.98205178 -0.36120135
C  -6.2132593 -0.74637541 -1.61451164
C  -4.84656536 -0.61548156 -1.7018862
C  -4.0640065 -0.71932062 -0.51847304
N  -2.71616486 -0.59149379 -0.64255209
H  -1.77848684 -0.99566698 2.47245323
H  -4.23158759 -1.23509267 2.85294249
H  -6.58917321 -1.2661062 1.7565647
H  -7.92668518 -1.08131324 -0.32714946
H  -6.82262007 -0.67101587 -2.50901552
H  -4.34626801 -0.43684869 -2.64752319
N  2.09321013 -0.36571542 -0.27167591
C  2.74710324 0.8284303 -0.44569011
C  4.10546915 0.8966908 -0.63028346
C  4.8844439 -0.28931701 -0.6351228
C  6.29076235 -0.30552019 -0.81757528
C  6.97035938 -1.50760073 -0.80541946
C  6.28472814 -2.73586708 -0.6128073
C  4.91802399 -2.75265277 -0.43444631
C  4.19473396 -1.5291003 -0.44300679
C  2.79348551 -1.49890715 -0.27002714
H  2.14178345 1.72400299 -0.43933213
H  4.57676987 1.86327627 -0.77196677
H  6.81703479 0.63237722 -0.96473053
H  8.04683373 -1.51918544 -0.94526441
H  6.84605896 -3.66455349 -0.60749575
H  4.38033281 -3.68437495 -0.28753508
H  2.23392359 -2.41729918 -0.13326424
