program: Gaussian 09
title: /home/michael/molsimp_comfiles/Mn_3a1_20_OH/Mn_3a1_20_OH.com auto generated
version: ES64L-G09RevE.01
frameworkgroup: C1[X(C28H21MnN5O3)]
method: UTPSSh
basis: Gen
operation: Freq
keyword: #P
keyword: Geom=AllCheck
keyword: Guess=TCheck
keyword: SCRF=Check
keyword: GenChk
keyword: UTPSSh/ChkBas
keyword: Freq
title: /home/michael/molsimp_comfiles/Mn_3a1_20_OH/Mn_3a1_20_OH.com auto gene
converged: YES YES YES YES
polarizability: 7.29767249e+02 4.81709120e-01 6.40697405e+02 3.46956356e+01 1.80010271e+01 5.76055816e+02
1716.lowfreq: -13.0238 -0.0006 0.0005 0.0008 7.9705 15.5096 24.4113 25.6347 39.6539
frequency: 22.1585 25.5747 39.3127 41.7038 43.7595 53.1475 66.8802 93.8242 105.3916 109.3584 123.5138 136.4351 153.9298 164.7263 175.4970 182.2283 184.1076 188.3629 202.3770 222.4752 234.0652 248.7046 267.7048 271.4803 279.5570 302.3494 314.0641 341.6301 367.7438 389.2737 392.6205 396.8231 408.6299 411.6603 426.1197 442.0447 461.5612 474.1528 475.9194 488.8279 492.1552 510.6019 526.5263 532.7233 541.0085 553.2064 568.2415 578.3488 598.5316 640.0313 642.6495 643.8723 650.3099 654.6805 659.6646 666.9986 698.8143 716.5459 756.9394 764.0595 764.8064 765.9777 772.7983 773.3458 788.9572 789.4825 790.3932 794.8947 830.0756 837.4788 841.6623 846.5630 857.9331 878.4987 894.9579 894.9959 920.6789 950.1388 958.8097 968.0837 977.0228 978.3861 992.1165 995.3434 1002.8818 1004.6161 1012.1365 1024.1717 1029.3421 1029.5068 1033.1616 1034.0640 1037.6382 1040.9936 1049.7613 1065.3175 1071.1743 1094.6397 1105.0872 1108.5428 1132.3479 1154.8696 1158.0987 1158.9684 1176.1897 1178.4075 1180.2804 1191.9027 1195.3724 1208.5736 1255.5675 1259.6721 1275.2482 1286.5210 1288.5247 1301.4554 1310.9073 1320.7326 1323.9785 1353.3165 1359.9994 1375.6479 1391.4227 1419.8119 1434.5525 1440.1510 1445.6408 1457.3238 1478.8801 1480.4559 1485.4030 1493.2947 1497.4654 1531.1521 1538.7265 1544.9918 1583.8665 1602.1387 1605.3439 1611.6232 1612.4409 1636.3820 1638.8458 1642.7655 1658.0695 1664.7159 1687.1179 3207.2668 3213.4342 3216.6489 3222.1423 3223.7937 3229.7283 3231.7534 3232.2442 3236.7394 3236.8260 3237.8211 3238.0317 3238.2453 3246.2853 3253.2747 3253.4625 3256.5715 3257.3698 3288.6233 3288.9649 3290.6914
redmass: 6.2878 6.5337 4.5544 4.4878 5.4281 5.8448 8.5394 5.5856 5.1024 5.1475 7.2404 6.1327 6.3117 5.8093 6.4197 5.3126 4.5497 4.3897 6.3723 7.9817 6.5509 6.0697 5.9295 5.8592 6.9340 14.2988 9.3679 11.3634 8.5997 3.8370 4.2199 3.2081 5.2212 7.4398 3.6431 4.0113 4.1672 3.0631 2.9179 3.4227 3.5711 8.2718 6.8674 6.9836 8.1838 7.8655 4.1559 6.2629 1.1543 3.5882 6.7871 7.2751 8.8694 8.3018 4.1143 8.0067 8.2386 5.6428 2.2372 1.4377 6.3305 1.3428 3.1912 2.3502 3.9568 3.9711 4.7078 1.6651 1.4140 5.8495 5.8161 2.1406 1.3088 7.5590 1.3846 1.5013 1.3479 1.4704 1.3934 4.9482 5.3054 1.3375 1.3214 1.3706 1.3605 1.3886 1.1449 1.3145 1.4006 5.8138 2.2858 1.3714 1.3589 2.3709 5.9005 3.2047 2.7307 2.6322 2.8079 1.7509 2.5854 2.0261 1.5023 1.4914 1.1761 1.1019 1.0884 1.4297 1.2546 1.3739 2.2713 2.9009 2.8577 1.6499 1.7583 1.7892 1.5678 3.0309 5.7679 3.1317 3.1468 4.0151 4.5503 1.6205 6.7973 2.6227 5.4256 2.1104 2.7070 2.2740 2.3087 2.7077 1.9334 3.6285 2.9822 3.1397 6.5801 6.0251 5.8781 6.3796 6.0169 6.0160 5.1133 6.2688 5.5348 5.9205 13.0441 1.0870 1.0892 1.0877 1.0955 1.0896 1.0986 1.0961 1.0921 1.0899 1.0934 1.0933 1.0989 1.0908 1.0918 1.0943 1.0943 1.0977 1.0994 1.0928 1.0876 1.0749
irintensity: 1.7596 2.2380 0.3113 0.7212 1.1416 8.4572 2.1021 0.0855 3.1983 2.1304 0.5235 1.5037 0.5767 3.1537 5.1476 5.0035 0.3295 1.3526 1.6250 18.2823 15.1309 4.8704 4.4289 13.2925 21.5604 169.0917 6.5221 121.5655 3.6951 3.0623 0.8379 3.0653 28.2987 79.7136 12.9560 33.3181 5.3553 32.9165 14.8512 30.1704 4.7324 40.9825 0.0336 0.0218 14.4318 42.4922 0.9368 17.1336 169.9176 16.7855 27.1925 1.7856 78.0211 143.7656 4.9576 144.3950 109.5124 62.6623 0.2990 45.0294 51.8641 24.0146 3.1463 77.2447 26.9148 32.9551 4.1918 68.2071 88.0147 10.4427 13.2039 14.3208 72.1228 57.1544 14.0213 9.8288 0.0962 15.8756 0.0557 1.0764 1.2409 0.4783 0.5792 7.7203 3.3115 6.0938 243.5550 0.0277 3.6457 60.4715 7.1205 0.6814 0.2558 14.7103 87.7666 16.6267 170.1761 89.3043 76.1164 72.8546 177.8904 193.8835 6.8100 14.7346 3.7823 7.8876 2.6883 7.4171 39.9887 58.8635 14.1174 8.0384 208.3527 2.0423 0.1492 17.1665 27.3315 27.0361 65.8767 29.2082 100.9517 5.0006 133.9492 52.6401 81.9787 14.0411 108.0897 23.4975 20.7852 14.1834 14.5219 281.6976 29.1662 78.6925 21.2367 16.4468 62.9822 5.5980 1.4572 45.1937 31.3908 56.0260 25.4316 65.9958 6.8363 116.0178 1343.2409 0.9257 0.6212 0.8012 19.3584 2.7224 29.5650 10.4644 1.9414 5.8579 1.5125 7.1022 14.9193 2.3065 5.0057 1.5415 6.9144 1.8244 2.4816 5.9240 249.1729 1043.6175
temp: 298.150 k
press: 1.00000 atm
elementType: 25 8 6 8 6 6 6 6 6 6 6 6 6 6 7 7 1 1 1 1 1 1 1 8 1 7 6 6 6 6 6 6 6 6 7 1 1 1 1 1 1 7 6 6 6 6 6 6 6 6 6 1 1 1 1 1 1 1
symmnumber: 1
zpe: 1159547.0 jmol-1
zpe.correction: 0.441648 hartree
zpe.thermalcorrener: 0.471181 hartree
zpe.thermalcorrenthalpy: 0.472126 hartree
zpe.thermalcorrgfe: 0.379964 hartree
zpe.sumelectzpe: -1682.476932 hartree
zpe.sumelectthermal: -1682.447398 hartree
zpe.sumelectthermalent: -1682.446454 hartree
zpe.sumelectthermalfe: -1682.538616 hartree
dipole: -7.1397 14.0087 -8.2252
dipole: 17.7447
quadrupole: -55.0428 -124.8224 -184.5302
quadrupole: 4.2654 -6.5476 6.6490
quadrupole: 66.4223 -3.3573 -63.0651 4.2654 -6.5476 6.6490
hfenergy: -1682.9185798 hartree
pointgroup: C01 [X(C28H21Mn1N5O3)]
dipole: -2.7609933 6.1784936 -1.7151272 debye
polarizability: 730.8384834|-8.8733633|628.3276901|31.3103402|31.0324452|587.3542968 unknown
InChI: InChI=1S/C11H7N2O2.C9H7N.C8H6N2.Mn.H2O/c14-11(15)10-6-3-5-9(13-10)8-4-1-2-7-12-8;1-2-4-9-7-10-6-5-8(9)3-1;1-2-4-8-7(3-1)5-6-9-10-8;;/h1-7H;1-7H;1-6H;;1H2/q-3;2*-1;+6;/p-1
charge 2 multiplicity 4
58 atoms
Mn 0.02423362 -0.26331741 -0.02451748
O  0.79472138 -1.25603907 3.74153204
C  0.5440304 -0.67302165 2.69115911
O  0.28814566 -1.31270315 1.55184392
C  0.47613378 0.81894261 2.55733916
C  0.63239055 1.77978771 3.54781666
C  0.47797938 3.12381801 3.17823565
C  0.17458986 3.47884279 1.8601421
C  0.0347119 2.46242283 0.91049584
C  -0.27657139 2.56983802 -0.52187702
C  -0.51986963 3.75126787 -1.2129529
C  -0.77155545 3.69064615 -2.58680071
C  -0.76884638 2.45620038 -3.2346815
C  -0.5252804 1.30116587 -2.49325541
N  -0.28848416 1.36267124 -1.17189305
N  0.19575503 1.1809582 1.29530136
H  0.86031494 1.48753849 4.56567271
H  0.59120048 3.90155449 3.92489767
H  0.04925059 4.51721291 1.57891203
H  -0.50904579 4.69824104 -0.6868796
H  -0.96228719 4.60252296 -3.14122362
H  -0.95258567 2.37343378 -4.29892688
H  -0.51300415 0.31293948 -2.93665854
O  -0.1375813 -1.4865593 -1.30498907
H  -1.10788041 -1.69961189 -1.37955446
N  -2.0594112 -0.35524451 0.23575626
C  -2.75831306 0.32951224 1.17950293
C  -4.1241959 0.16675633 1.30469863
C  -4.788372 -0.7227601 0.44405646
C  -6.18274214 -0.98216016 0.46989559
C  -6.71937164 -1.8823285 -0.4244146
C  -5.90074869 -2.55818842 -1.37460674
C  -4.54553547 -2.33224249 -1.43042925
C  -3.97000653 -1.40680719 -0.51809905
N  -2.63408147 -1.19386431 -0.58314965
H  -2.20010705 0.99709732 1.81886422
H  -4.66301643 0.7227793 2.06375074
H  -6.80290732 -0.46689814 1.19538795
H  -7.78481933 -2.08658222 -0.41042778
H  -6.36019695 -3.26073061 -2.06154808
H  -3.90498522 -2.83659882 -2.14542516
N  2.0077155 -0.25149044 -0.36609098
C  2.72705918 0.87178737 -0.69771813
C  4.07665886 0.81249556 -0.93204339
C  4.76714801 -0.42383786 -0.83907103
C  6.15798217 -0.56301773 -1.07022716
C  6.74977745 -1.80631245 -0.95870918
C  5.98919702 -2.9546458 -0.61508236
C  4.6344435 -2.85250689 -0.38413424
C  4.00188754 -1.58412474 -0.49294393
C  2.61867864 -1.43379091 -0.26705406
H  2.1865427 1.80426163 -0.77000133
H  4.60896202 1.72083263 -1.19211557
H  6.74206318 0.31298627 -1.33323306
H  7.81535878 -1.91253274 -1.13634306
H  6.48399952 -3.91694309 -0.53548682
H  4.03925504 -3.72110514 -0.12075314
H  2.00583458 -2.2886948 -0.00565008
