program: Gaussian 09
title: /home/michael/molsimp_comfiles/Mn_3a1_18_OH/Mn_3a1_18_OH.com auto generated
version: ES64L-G09RevE.01
frameworkgroup: C1[X(C24H18MnN4O4)]
method: UTPSSh
basis: Gen
operation: Freq
keyword: #P
keyword: Geom=AllCheck
keyword: Guess=TCheck
keyword: SCRF=Check
keyword: GenChk
keyword: UTPSSh/ChkBas
keyword: Freq
title: /home/michael/molsimp_comfiles/Mn_3a1_18_OH/Mn_3a1_18_OH.com auto gene
converged: YES YES NO YES
polarizability: 6.43758465e+02 -1.23753182e+02 4.69685655e+02 2.10880137e+00 7.79095751e+00 5.64320711e+02
1716.lowfreq: -14.2042 -7.7728 -0.0006 0.0002 0.0007 6.0402 24.4889 31.1222 31.7054
frequency: 24.1060 31.1087 31.4422 45.2751 48.8107 54.6675 61.5449 79.2939 112.6828 122.1538 134.6588 168.8333 171.8662 176.6180 184.4453 191.8353 198.6478 212.0866 230.0087 240.8551 255.2497 265.1991 282.1036 288.1211 301.2402 325.6197 331.4201 353.4480 354.9762 391.9704 394.0275 401.7876 445.8111 448.9759 452.5412 473.2596 487.8399 521.0881 536.6180 542.6444 579.1597 585.9553 610.6628 623.6442 641.0647 642.5700 650.1789 651.2705 654.1754 693.4176 695.3958 696.9155 702.1939 743.6552 749.7142 763.1433 769.9292 770.2650 772.3861 797.2686 821.0432 836.9684 860.0149 867.4049 882.6486 884.4407 892.3677 928.7588 952.5302 966.7351 967.0790 986.5316 991.9791 995.7060 998.5800 999.7420 1028.6568 1029.2095 1029.7835 1035.1868 1038.2506 1045.4141 1047.6861 1063.3686 1073.4219 1089.2433 1091.2968 1101.6881 1106.5488 1107.5746 1158.8622 1169.9035 1171.5963 1171.7671 1179.3909 1214.6530 1224.1583 1234.0408 1250.0780 1262.3854 1295.5692 1304.6409 1328.3616 1328.8233 1330.7291 1342.9868 1364.8947 1374.2228 1384.4645 1428.0942 1430.0609 1465.7406 1477.8798 1480.0748 1480.7409 1505.4158 1517.0398 1521.2768 1527.4835 1555.9402 1566.7097 1598.6608 1621.6169 1622.5437 1641.6763 1647.9902 1651.2687 1651.9523 1663.5665 3194.6608 3201.5555 3212.9565 3215.0655 3219.2990 3219.6533 3224.8072 3225.8888 3233.3574 3233.7109 3234.1339 3238.2555 3238.5423 3250.4546 3252.6852 3253.9488 3260.2225 3611.4275
redmass: 5.7362 4.7396 5.2957 5.3481 4.0020 5.2985 6.0608 5.6488 5.8009 6.2101 5.0337 5.8447 6.6756 6.3901 6.1968 6.4927 9.1117 5.6336 8.9028 10.0387 11.0375 8.5863 6.6836 8.1317 10.2559 10.8173 9.0709 8.8860 7.0768 2.6777 2.6812 10.4515 4.1224 4.1825 4.4315 7.9033 4.5582 3.0024 3.1829 1.6666 3.8325 6.0966 8.1397 7.9331 6.8226 6.8368 6.3700 6.3332 5.7157 6.5711 1.7912 1.7781 4.3637 6.6032 4.1155 1.7441 1.7295 1.7285 1.5795 9.9696 2.7641 18.3246 6.1687 1.4886 1.2520 1.2529 6.3781 1.3925 1.3500 1.3202 1.3169 1.2880 8.5306 1.2804 1.4219 1.4249 1.3223 5.4233 1.3348 6.6357 6.8505 6.1538 6.5106 2.1921 1.8817 1.7022 1.7032 1.6922 2.6284 1.8935 1.5603 1.3805 1.0783 1.0775 1.2040 2.4013 1.2181 1.2327 1.8337 2.6764 2.0110 2.9158 8.1181 8.4066 6.3080 3.9876 6.4560 1.2465 1.2252 4.4130 3.4122 4.2517 2.6330 2.2528 2.2668 2.8369 1.9886 1.9401 3.5966 9.7361 5.0308 5.7957 5.4341 5.5503 6.4924 6.9346 5.2601 5.3687 6.9325 1.0887 1.0882 1.0875 1.0935 1.0888 1.0888 1.0919 1.0979 1.0969 1.0908 1.0902 1.0958 1.0950 1.0946 1.0950 1.0971 1.0942 1.0824
irintensity: 1.2392 3.2857 3.4031 8.5871 1.3914 8.5637 3.6526 3.0673 0.4592 6.9096 1.4210 2.8080 1.3604 11.1976 6.9940 3.2821 2.1961 1.5045 14.6065 16.8629 18.2532 2.1867 26.6449 10.8939 41.8388 139.3097 72.5668 195.1931 106.9303 0.1583 0.0363 1.4255 21.4644 5.0524 9.9553 6.5448 4.2217 90.4328 72.0753 91.0472 5.3101 17.2367 35.3069 42.7296 17.0899 23.4011 2.6047 1.5258 5.5106 4.2775 90.6856 93.1094 5.2249 11.6675 6.0269 173.9388 38.2594 58.1570 34.8893 96.6966 3.4590 650.0729 98.8601 9.2364 0.4680 0.1105 31.5450 0.4822 4.2950 1.7352 1.0384 1.2547 3.4877 0.4138 0.2924 0.1327 0.1347 13.9444 0.3544 39.9389 4.4313 1.7702 4.8806 19.4199 40.5930 96.8176 3.9270 1.4635 13.3273 6.7931 57.9876 32.8815 1.7912 3.1024 9.0704 254.6157 50.0938 29.8774 62.4956 166.7873 128.4358 279.5134 3.8300 4.7666 229.2435 513.2302 117.3752 7.9921 9.0479 120.1477 56.5405 153.6102 48.6402 70.8889 73.4163 509.8505 5.5143 8.5491 197.1217 1570.3465 139.6753 48.7047 2.5399 4.6670 188.7073 12.1952 14.1196 72.9302 35.9088 10.6599 4.0400 2.9441 24.8032 3.9571 4.4079 6.6684 39.2613 17.5298 1.7794 1.1516 1.2911 1.5031 10.0967 8.6685 9.4349 12.3420 290.4530
temp: 298.150 k
press: 1.00000 atm
elementType: 25 8 6 8 6 6 6 6 6 7 6 6 6 6 6 6 6 8 7 6 1 1 1 1 1 1 1 1 8 7 6 6 6 6 6 1 1 1 1 1 7 6 6 6 6 6 1 1 1 1 1
symmnumber: 1
zpe: 1002205.0 jmol-1
zpe.correction: 0.381720 hartree
zpe.thermalcorrener: 0.408930 hartree
zpe.thermalcorrenthalpy: 0.409874 hartree
zpe.thermalcorrgfe: 0.322374 hartree
zpe.sumelectzpe: -1549.097711 hartree
zpe.sumelectthermal: -1549.070500 hartree
zpe.sumelectthermalent: -1549.069556 hartree
zpe.sumelectthermalfe: -1549.157056 hartree
dipole: -6.5926 6.2292 17.8971
dipole: 20.0641
quadrupole: -158.2169 -173.0819 -182.0366
quadrupole: 41.9777 7.0827 -6.7666
quadrupole: 12.8949 -1.9701 -10.9248 41.9777 7.0827 -6.7666
hfenergy: -1549.4794303 hartree
pointgroup: C01 [X(C24H18Mn1N4O4)]
dipole: 2.1819322 3.2979641 -6.8319323 debye
polarizability: 588.733275|147.4967165|525.2010076|12.2022907|-6.7536432|563.8305484 unknown
InChI: InChI=1S/C14H8N2O3.2C5H5N.Mn.O/c17-11-7-2-1-4-8(11)13-15-10-6-3-5-9(14(18)19)12(10)16-13;2*1-2-4-6-5-3-1;;/h1-7,15H;2*1-5H;;/q-3;2*-1;+5;
charge 0 multiplicity 4
51 atoms
Mn 0.00523418 -0.09207525 1.18764077
O  -2.6418109 -3.24312015 0.66203019
C  -1.88927766 -2.30787863 0.30222411
O  -1.07807359 -1.74619551 1.1617228
C  -1.88420151 -1.86036161 -1.11886218
C  -2.69174526 -2.46703066 -2.09064942
C  -2.63024149 -2.08789071 -3.44307475
C  -1.75302324 -1.09699284 -3.89551754
C  -0.94864455 -0.49124821 -2.93087483
N  0.02317625 0.49629944 -2.99113367
C  0.49839211 0.71495888 -1.72891252
C  1.52292966 1.66631406 -1.35533536
C  2.32302083 2.2959728 -2.33385707
C  3.30329483 3.21415038 -1.98327776
C  3.50264676 3.52137331 -0.62808034
C  2.73062347 2.91307554 0.35440897
C  1.72580805 1.97788713 0.02207885
O  1.00563505 1.49007861 1.04322082
N  -0.12260983 -0.08803594 -0.85652087
C  -1.01971825 -0.85071986 -1.56954543
H  -3.37249651 -3.25469176 -1.78617357
H  -3.27516331 -2.5863357 -4.15914295
H  -1.70090389 -0.81722646 -4.94191942
H  0.30834733 0.99893864 -3.82408352
H  2.1807329 2.04737578 -3.38137967
H  3.91035065 3.68160859 -2.75102383
H  4.26805759 4.23519088 -0.33827001
H  2.87630326 3.14773368 1.40425568
O  0.08376751 -0.11402096 2.86532337
N  -1.76867196 0.96779471 1.2339812
C  -2.73785285 0.55936353 2.07978657
C  -3.9603396 1.21649657 2.16964141
C  -4.18941687 2.33517945 1.36589606
C  -3.18167915 2.7571666 0.49742144
C  -1.98443677 2.0482974 0.45630295
H  -2.50711782 -0.3080985 2.68506955
H  -4.7113173 0.85230715 2.86124738
H  -5.13329997 2.86792676 1.41669478
H  -3.31009379 3.62183432 -0.14355649
H  -1.17588783 2.34628443 -0.19924131
N  1.72967797 -1.19180236 1.02363606
C  2.80038002 -0.82009571 1.75563578
C  4.00740375 -1.50796252 1.69225927
C  4.11186638 -2.61830889 0.85161982
C  3.00012027 -2.999006 0.09823688
C  1.82578572 -2.25986644 0.20568627
H  2.6626333 0.04136722 2.39712226
H  4.84301647 -1.17341112 2.29628601
H  5.04075057 -3.17517459 0.7854827
H  3.03122751 -3.85367568 -0.56764053
H  0.9418145 -2.5191768 -0.36284189
