program: Gaussian 09
title: /home/michael/molsimp_comfiles/Mn_32a_35_O5H/Mn_32a_35_O5H.com auto generated
version: ES64L-G09RevE.01
frameworkgroup: C1[X(C15H9MnN5O5)]
method: UTPSSh
basis: Gen
operation: Freq
keyword: #P
keyword: Geom=AllCheck
keyword: Guess=TCheck
keyword: SCRF=Check
keyword: GenChk
keyword: UTPSSh/ChkBas
keyword: Freq
title: /home/michael/molsimp_comfiles/Mn_32a_35_O5H/Mn_32a_35_O5H.com auto ge
converged: YES YES NO YES
polarizability: 4.90085281e+02 4.16624709e+01 3.64432971e+02 -1.93215247e+01 5.02426687e+00 3.60160600e+02
1716.lowfreq: -0.0004 -0.0002 0.0006 9.7107 20.5335 24.1748 40.0773 45.4458 57.1888
frequency: 39.1137 44.2696 56.2188 81.1612 90.9970 118.1774 152.5524 158.8536 170.2037 177.7061 192.7779 208.6199 217.4767 221.9202 248.0188 274.5858 277.0879 284.3460 294.5151 344.5570 365.2310 381.5570 421.6620 425.4677 429.6658 433.1946 447.8901 448.1893 468.1750 499.2204 548.8761 552.8217 592.8462 602.4786 641.0400 664.3989 670.6499 685.1709 696.3432 713.6468 757.7953 764.5227 777.6093 781.8129 802.8215 826.9912 833.6926 846.4921 853.0020 914.9106 964.1585 1017.9127 1018.9211 1029.9232 1031.5228 1032.4433 1036.3653 1039.6677 1048.3282 1078.1590 1087.7318 1109.9538 1121.3614 1132.5741 1139.9725 1142.4543 1168.3219 1175.6983 1262.0804 1267.9596 1278.6849 1312.1946 1323.0171 1333.9824 1370.7993 1402.4952 1445.1891 1449.4183 1463.4745 1486.3735 1512.5197 1515.7557 1599.4786 1607.9461 1620.1442 1621.0100 1631.6375 1636.5433 1692.1296 1708.4626 3237.9077 3239.3640 3240.2338 3251.2319 3251.3878 3253.3451 3256.0171 3265.5443 3268.1967
redmass: 7.0530 8.2184 6.2931 8.9026 6.2103 5.5989 9.0107 8.1656 5.2167 8.8591 7.7519 7.3471 8.0584 11.3567 11.4946 5.8148 10.2612 7.0381 14.9628 13.9723 10.9183 12.1053 3.2766 10.2575 6.9256 7.1732 5.4539 4.6872 6.1415 7.0991 2.6838 11.2176 7.3741 17.3333 8.0849 8.0785 7.6999 7.6949 7.9803 12.0336 3.9613 2.0937 8.0911 11.6590 6.6342 1.9081 1.4456 2.5263 2.1582 8.3420 1.3882 1.3511 1.3578 1.4586 2.2105 2.8390 8.5160 1.3769 5.2953 4.5148 2.2570 2.3046 5.3582 1.5811 2.2279 2.1465 1.9842 1.1574 2.2015 1.8877 2.8966 7.8023 10.2077 2.1119 2.2453 4.7513 2.3099 3.0685 1.9293 2.2145 3.3134 5.2516 4.6562 4.4177 6.5309 7.7037 7.0299 6.7184 13.1287 13.0758 1.0927 1.0924 1.0907 1.0930 1.0941 1.0924 1.0976 1.0992 1.0992
irintensity: 0.9745 0.2616 12.4027 19.9999 20.4562 0.6836 3.9342 0.2122 1.2200 10.7611 3.9923 3.9305 12.4073 30.1516 15.0417 5.1972 65.9535 9.4645 34.1391 157.6064 19.3259 44.2966 1.0149 32.0832 35.8758 20.1377 36.3565 26.1575 2.2946 4.7271 0.2965 4.5959 13.4493 105.1656 0.3314 88.7061 35.5506 43.8374 55.1114 173.6139 99.3935 60.3776 0.5347 4.6680 6.6732 0.4555 43.3835 2.1904 17.7305 79.1635 0.0217 0.2709 0.3322 0.4597 6.1695 9.1947 0.9201 0.9594 80.8363 11.3706 239.9238 1.5577 251.1919 34.8313 154.3759 157.0568 6.6733 1.5557 3.2502 84.2005 31.6689 880.5526 15.1699 6.5041 10.8592 92.5944 163.5378 74.4526 134.3876 48.3631 67.7346 15.8924 53.4010 59.9279 378.0096 45.3825 2.6785 46.1293 1988.2131 480.0410 11.4471 10.0746 1.3198 9.6602 7.6653 4.0654 4.4256 2.8168 1.0475
temp: 298.150 k
press: 1.00000 atm
elementType: 25 8 6 8 6 6 6 6 6 6 8 8 7 1 1 1 6 6 7 6 6 7 6 6 6 7 7 6 1 1 1 1 1 1 8
symmnumber: 1
zpe: 620152.1 jmol-1
zpe.correction: 0.236203 hartree
zpe.thermalcorrener: 0.256702 hartree
zpe.thermalcorrenthalpy: 0.257646 hartree
zpe.thermalcorrgfe: 0.186485 hartree
zpe.sumelectzpe: -1330.568574 hartree
zpe.sumelectthermal: -1330.548075 hartree
zpe.sumelectthermalent: -1330.547131 hartree
zpe.sumelectthermalfe: -1330.618292 hartree
dipole: 1.8297 3.2884 1.2943
dipole: 3.9795
quadrupole: -68.2240 -108.2559 -188.3909
quadrupole: 27.8652 14.7773 3.5470
quadrupole: 53.3996 13.3677 -66.7673 27.8652 14.7773 3.5470
hfenergy: -1330.8047775 hartree
pointgroup: C01 [X(C15H9Mn1N5O5)]
dipole: -0.7128082 1.2804672 -0.5510332 debye
polarizability: 488.6897861|-43.8128445|364.9693253|-19.3014101|-4.4438125|361.0197411 unknown
InChI: InChI=1S/C8H6N4.C7H3NO4.Mn.O/c1-3-9-7(10-4-1)8-11-5-2-6-12-8;9-6(10)4-2-1-3-5(8-4)7(11)12;;/h1-6H;1-3H;;/q-2;-3;+5;
charge 1 multiplicity 3
35 atoms
Mn -0.01695626 -0.78005503 0.26157085
O  -2.31128526 0.13237709 3.39545925
C  -1.85981478 -0.08863625 2.27761643
O  -0.57176138 -0.32242771 2.0466346
C  -2.66848899 -0.09513004 1.0168269
C  -4.02257538 0.16678124 0.82930432
C  -4.52123772 0.15652039 -0.48022881
C  -3.67473195 -0.09945954 -1.56732225
C  -2.33289659 -0.35559913 -1.30303266
C  -1.21234937 -0.62432383 -2.25572552
O  -0.04649028 -0.79324114 -1.62576269
O  -1.31737124 -0.67100879 -3.47337848
N  -1.89036978 -0.35030554 -0.04068064
H  -4.65754442 0.37892996 1.68126072
H  -5.57178252 0.35839492 -0.6555834
H  -4.03651689 -0.09821628 -2.58864102
C  4.05086458 -2.17870415 0.18837174
C  2.66663454 -2.136283 0.29243495
N  2.02163069 -0.95920343 0.19448226
C  2.7406835 0.16883081 -0.00660475
C  1.9445429 1.41196817 -0.08547421
N  0.61206287 1.24244637 0.0676202
C  -0.1687353 2.33799496 0.04004224
C  0.38606388 3.59663966 -0.15699365
C  1.76727986 3.66659142 -0.32210953
N  2.55362392 2.57663306 -0.28114194
N  4.06249253 0.20433894 -0.12022198
C  4.711721 -0.96986398 -0.02178956
H  4.58607508 -3.11604388 0.26871162
H  2.05517252 -3.01573456 0.45383369
H  -1.23409535 2.19911174 0.17783611
H  -0.23782452 4.48092099 -0.1811293
H  2.26749328 4.61445034 -0.48788656
H  5.79145348 -0.92924164 -0.11439055
O  -0.22421866 -2.40186114 0.54747961
