program: Gaussian 09
title: /home/michael/molsimp_comfiles/Mn_32a_35_OH/Mn_32a_35_OH.com auto generated
version: ES64L-G09RevE.01
frameworkgroup: C1[X(C15H10MnN5O5)]
method: UTPSSh
basis: Gen
operation: Freq
keyword: #P
keyword: Geom=AllCheck
keyword: Guess=TCheck
keyword: SCRF=Check
keyword: GenChk
keyword: UTPSSh/ChkBas
keyword: Freq
title: /home/michael/molsimp_comfiles/Mn_32a_35_OH/Mn_32a_35_OH.com auto gene
converged: YES YES NO YES
polarizability: 4.82569254e+02 -3.75983903e+01 3.70483487e+02 -1.30310325e+01 -2.30870464e+00 3.54075899e+02
1716.lowfreq: -0.0004 0.0006 0.0008 9.3890 22.3358 28.2937 39.9613 45.7938 61.1214
frequency: 37.7919 45.0113 60.6104 82.9949 92.2464 113.5288 147.7620 154.1010 176.5712 181.6841 189.1767 194.8358 233.9869 237.1268 260.9323 267.7078 283.3499 284.7243 302.5472 346.9908 358.4129 364.3811 377.9357 419.0424 420.4442 431.4466 431.6856 440.2334 453.9054 472.3598 498.1744 546.9683 554.8301 592.7994 640.3234 649.8798 666.3885 676.9835 689.3802 697.2291 720.6559 755.0246 768.8165 785.8601 788.9266 801.9346 824.6782 831.5325 844.1590 856.3503 909.3953 915.4006 966.7757 1008.0745 1020.1525 1029.4093 1030.9008 1032.6711 1036.6029 1041.0064 1050.9386 1075.8773 1091.3875 1107.2865 1127.0334 1131.1251 1140.9079 1145.7912 1166.6638 1176.0685 1261.5539 1265.7475 1278.7606 1313.5497 1322.0088 1332.3366 1369.6952 1400.5897 1442.1246 1448.9090 1462.9118 1486.4080 1512.5226 1515.8620 1598.1263 1606.5886 1620.0342 1620.5745 1632.6661 1636.2518 1688.4713 1700.3768 3238.8001 3239.0381 3239.4758 3249.3114 3251.4656 3253.2796 3255.1565 3265.0924 3268.2059 3701.3628
redmass: 7.3901 7.6073 6.1445 7.8129 6.8305 5.9007 8.1994 7.4069 5.1759 6.5569 7.1065 7.3022 7.9151 7.7463 7.8093 5.6160 7.0084 11.3898 12.1595 2.1620 1.9914 9.1424 12.2865 4.4819 4.3802 5.2067 12.8576 7.5583 4.0056 6.0099 7.0868 2.6273 11.3948 7.2950 8.0967 13.9847 8.6838 7.6740 7.6148 8.0384 11.5107 3.8998 2.0336 7.9032 12.0339 6.6422 1.8880 1.3830 2.8465 2.2252 1.1025 8.1978 1.3905 1.3636 1.3563 1.4335 1.4572 9.1546 8.5587 1.3665 4.8245 4.3112 2.2699 2.3665 5.3845 1.5721 1.5663 3.6809 2.0138 1.1591 2.2222 1.8726 2.9073 8.0375 9.3208 2.1427 2.2311 4.7932 2.2715 3.1908 1.9239 2.2366 3.2811 5.2668 4.7043 4.4246 7.2155 6.9036 7.0238 6.7813 13.1195 13.0288 1.0927 1.0907 1.0924 1.0933 1.0937 1.0932 1.0979 1.0990 1.0993 1.0657
irintensity: 0.6448 0.7511 10.5582 23.5089 19.7123 1.1765 3.7447 0.8492 0.4673 3.4289 5.1210 0.8401 1.1838 9.4347 1.1712 8.9637 22.0842 63.4726 31.4353 223.5651 165.3434 37.4043 42.3963 19.9512 10.3913 3.2059 61.7910 108.9258 11.4794 0.4103 4.6487 0.0980 1.6559 14.6186 0.9861 257.4201 183.6457 59.7157 34.2568 91.5656 226.8537 108.1613 66.6452 1.2043 2.1184 5.3876 0.3529 44.1250 0.1807 11.9097 187.3415 99.3565 0.0146 0.1561 0.2357 0.2087 0.0739 20.2530 1.5945 0.2322 60.6439 7.7326 222.6912 2.2693 215.0915 38.7810 27.2346 262.6822 6.7916 1.5812 3.9671 82.8781 29.3766 870.7101 41.4560 6.3921 11.0634 88.0348 171.3307 44.1218 141.5124 58.3724 63.3449 15.8238 47.1638 65.9819 198.2178 219.3979 4.8025 43.8573 2417.1174 178.6907 12.3537 1.2789 9.6555 10.8400 6.7313 5.1557 3.2883 2.6211 1.4311 295.1907
temp: 298.150 k
press: 1.00000 atm
elementType: 25 8 6 8 6 6 6 6 6 6 8 8 7 1 1 1 6 6 7 6 6 7 6 6 6 7 7 6 1 1 1 1 1 1 8 1
symmnumber: 1
zpe: 650380.6 jmol-1
zpe.correction: 0.247717 hartree
zpe.thermalcorrener: 0.268539 hartree
zpe.thermalcorrenthalpy: 0.269483 hartree
zpe.thermalcorrgfe: 0.197629 hartree
zpe.sumelectzpe: -1331.232426 hartree
zpe.sumelectthermal: -1331.211604 hartree
zpe.sumelectthermalent: -1331.210660 hartree
zpe.sumelectthermalfe: -1331.282514 hartree
dipole: -1.6520 3.2924 1.0780
dipole: 3.8381
quadrupole: -70.9333 -106.4908 -189.1712
quadrupole: -26.9129 11.6866 -13.0072
quadrupole: 51.2651 15.7077 -66.9728 -26.9129 11.6866 -13.0072
hfenergy: -1331.480143 hartree
pointgroup: C01 [X(C15H10Mn1N5O5)]
dipole: -0.618108 1.3219904 0.3878775 debye
polarizability: 480.4159486|-39.5510763|371.0915061|-16.9140975|-1.1893978|355.6211854 unknown
InChI: InChI=1S/C8H6N4.C7H3NO4.Mn.H2O/c1-3-9-7(10-4-1)8-11-5-2-6-12-8;9-6(10)4-2-1-3-5(8-4)7(11)12;;/h1-6H;1-3H;;1H2/q-2;-3;+6;/p-1
charge 1 multiplicity 4
36 atoms
Mn 0.0032814 -0.73248995 0.27717016
O  -2.1056987 0.25198676 3.50481157
C  -1.71026466 -0.00207829 2.37220133
O  -0.44592204 -0.2949604 2.08347525
C  -2.58414606 -0.00944241 1.15349661
C  -3.94360432 0.26284355 1.03356912
C  -4.51686549 0.20334652 -0.24401526
C  -3.74153585 -0.12229218 -1.36511174
C  -2.38859016 -0.38427385 -1.17049246
C  -1.335737 -0.75423019 -2.17109706
O  -0.14297116 -0.9296951 -1.60677771
O  -1.53592888 -0.88004115 -3.37383038
N  -1.87244299 -0.31522272 0.06208904
H  -4.52763914 0.51453171 1.91079858
H  -5.57343169 0.41270577 -0.36696232
H  -4.16730211 -0.17268554 -2.36015758
C  4.05757901 -2.17211312 0.1174088
C  2.67634903 -2.12248869 0.25689029
N  2.0354708 -0.94450353 0.15110938
C  2.75288623 0.17514977 -0.092805
C  1.95209986 1.41443239 -0.1887245
N  0.61794659 1.2444053 -0.0304835
C  -0.16999445 2.33394164 -0.09338267
C  0.38053639 3.58986911 -0.3170834
C  1.76231148 3.66333206 -0.47396866
N  2.55315137 2.57764593 -0.40949231
N  4.07141263 0.20572947 -0.2385537
C  4.71760183 -0.96995711 -0.13190896
H  4.59222333 -3.10955718 0.2006436
H  2.0604461 -2.99257936 0.45053663
H  -1.23571101 2.19348903 0.03547296
H  -0.24802333 4.46970699 -0.36660801
H  2.25925305 4.61005753 -0.65493301
H  5.79494262 -0.93630959 -0.25117795
O  -0.25460965 -2.47220345 0.54785573
H  -0.42159202 -2.62412071 1.49933113
