program: Gaussian 09
title: 000031881
version: EM64L-G09RevD.01
frameworkgroup: C1[X(C8H19NO6S2)]
method: RPBEPBE
basis: SDD
operation: Freq
keyword: #p
keyword: freq=noraman
keyword: PBEPBE/SDD
title: #p freq=noraman PBEPBE/SDD
converged: YES YES NO NO
title: Mulliken charges:
elementType: S S O O O O O O N C C C C C C C C H H H H H H H H H H H H H H H H H H H
charge: 1.037813 1.038001 -0.412488 -0.412627 -0.532454 -0.511996 -0.512061 -0.532458 -0.316084 -0.350923 -0.351014 -0.267245 -0.267068 -0.515031 -0.515289 -0.630520 -0.630557 0.205312 0.224420 0.224358 0.205497 0.230473 0.237970 0.238003 0.230542 0.263186 0.277815 0.285826 0.285811 0.277855 0.261285 0.248352 0.237836 0.248343 0.261319 0.237801
chargesum: 0.00000
title: Mulliken charges with hydrogens summed into heavy atoms:
elementType: S S O O O O O O N C C C C C C C C
charge: 1.037813 1.038001 -0.412488 -0.412627 -0.532454 -0.511996 -0.512061 -0.532458 -0.052898 0.078808 0.078841 0.201199 0.201476 0.048609 0.048376 0.116954 0.116905
polarizability: 3.07427876e+02 -2.20704623e-02 1.46482176e+02 1.73304617e-03 7.81569129e-01 1.37155649e+02
1716.lowfreq: -11.2738 -4.4244 -0.0016 -0.0012 0.0005 2.7417 6.9698 7.7472 17.0550
frequency: 6.7013 6.9586 16.9733 21.8614 24.9781 39.9103 44.5680 50.7022 53.1123 94.2495 116.0449 128.8850 129.2876 166.3015 177.3648 180.5860 186.2482 209.9183 213.3569 236.1046 247.2246 255.5254 273.5809 285.6625 332.4832 340.3282 346.0536 380.7478 418.1458 451.4154 462.7734 520.7369 539.4063 558.5606 574.2193 640.9905 781.9359 781.9628 805.9706 817.0288 836.1906 838.9798 919.9239 923.4911 936.9078 937.2526 976.5695 977.0403 998.6513 1034.4943 1060.3873 1064.6943 1067.1002 1070.0981 1073.5058 1077.0439 1145.4911 1165.4194 1179.4399 1224.9776 1234.0858 1234.2185 1263.7777 1264.0913 1270.3795 1283.5266 1299.4027 1333.9564 1360.9720 1385.3582 1400.3593 1400.3894 1419.6174 1419.7046 1461.6112 1461.6557 1462.2095 1468.5820 1470.2676 1480.9823 1481.4621 1481.5225 1491.5850 2910.3254 2916.3916 2968.2926 2968.7809 2995.6383 2995.7076 3039.5954 3043.2004 3061.3406 3061.4239 3072.5276 3073.7757 3089.8100 3089.9453 3106.9385 3106.9964 3154.3677 3154.5782 3473.2222
redmass: 6.3598 5.1515 5.2297 5.0457 4.3159 2.5326 3.4577 2.6628 2.9669 1.9215 5.3606 5.0288 4.1374 3.8870 2.2135 1.8295 2.0577 3.6833 3.9043 2.6182 2.5920 4.1619 2.9201 4.0189 7.3088 8.8008 7.1098 5.0204 4.7519 6.0136 3.7143 5.7463 6.8647 9.3848 8.9448 1.2993 1.1803 1.1807 1.1695 1.3095 9.4184 6.1100 8.5033 7.3662 4.5812 4.5334 1.6842 1.6901 3.0106 3.5665 1.5079 1.7079 1.6794 2.6761 2.1689 2.4663 1.6496 2.6848 1.2991 1.3327 1.2369 1.2371 1.2476 1.2477 1.1336 1.1007 1.1751 1.2293 1.2628 1.3448 1.1754 1.1755 1.1101 1.1098 1.0416 1.0356 1.1467 1.0708 1.1360 1.0928 1.0526 1.0524 1.0830 1.0691 1.0699 1.0619 1.0621 1.0366 1.0366 1.0905 1.0888 1.0588 1.0588 1.1032 1.1029 1.0961 1.0961 1.1021 1.1021 1.1098 1.1098 1.0746
irintensity: 0.0785 0.1253 0.8737 0.3173 0.0481 4.2310 3.0761 1.2676 0.7960 10.5825 2.4638 0.8280 1.2307 1.1103 1.4233 4.3369 3.4486 38.6692 4.7533 10.1080 15.4853 18.3366 6.8938 0.2249 27.9560 0.2521 21.6442 2.0551 8.2601 97.7368 15.9926 42.1429 1.1871 17.9634 127.5470 94.5669 1.7511 5.4707 0.1622 8.8314 47.1008 118.9576 20.6783 95.0881 49.5211 130.1738 62.8174 10.4248 0.4969 0.4399 133.0485 12.0917 17.7235 2.3110 4.7751 4.9690 1.3605 226.7282 3.2949 1.8852 0.3981 2.7397 15.0285 15.7126 3.4837 2.5630 27.2854 2.5904 17.6191 0.7270 48.0364 8.7015 2.8455 4.4332 9.7132 36.8809 24.4526 11.1723 9.1991 3.8472 13.3694 12.9185 8.6734 23.8689 113.6327 33.3531 23.1032 12.9880 9.9826 0.4468 28.0746 3.4789 3.0879 3.3307 58.1840 7.9251 8.1215 6.2601 6.6698 2.2729 2.2721 0.2201
temp: 298.150 k
press: 1.00000 atm
elementType: 16 16 8 8 8 8 8 8 7 6 6 6 6 6 6 6 6 1 1 1 1 1 1 1 1 1 1 1 1 1 1 1 1 1 1 1
symmnumber: 1
zpe: 732946.6 jmol-1
zpe.correction: 0.279165 hartree
zpe.thermalcorrener: 0.302954 hartree
zpe.thermalcorrenthalpy: 0.303898 hartree
zpe.thermalcorrgfe: 0.217293 hartree
zpe.sumelectzpe: -1616.692980 hartree
zpe.sumelectthermal: -1616.669190 hartree
zpe.sumelectthermalent: -1616.668246 hartree
zpe.sumelectthermalfe: -1616.754852 hartree
dipole: -0.0076 8.3484 -0.0848
dipole: 8.3488
quadrupole: -97.4985 -120.5455 -128.5824
quadrupole: -0.0068 -0.0154 0.0668
quadrupole: 18.0437 -5.0034 -13.0403 -0.0068 -0.0154 0.0668
hfenergy: -1616.9721443 hartree
pointgroup: C01 [X(C8H19N1O6S2)]
dipole: 0.0019904 3.2204233 -0.6464998 debye
polarizability: 307.4243995|-0.0854997|145.7672362|-0.764356|-2.6011519|137.8740652 unknown
InChI: InChI=1S/C8H19NO6S2/c1-3-16(10,11)14-7-5-9-6-8-15-17(12,13)4-2/h9H,3-8H2,1-2H3
charge 0 multiplicity 1
36 atoms
S  5.172966 -0.472907 -0.010806
S  -5.172187 -0.466432 0.035457
O  3.62453 0.30488 0.739681
O  -3.616656 0.309275 0.77234
O  4.757122 -1.105003 -1.449493
O  5.956323 -1.393016 1.064682
O  -5.947623 -1.385871 1.11721
O  -4.769797 -1.098822 -1.406984
N  0.000465 -0.160196 0.015296
C  1.264188 0.563997 0.223071
C  -1.260992 0.56538 0.232112
C  2.387703 -0.462365 0.480799
C  -2.38264 -0.459453 0.503344
C  6.093809 1.214836 -0.221483
C  -6.092921 1.22159 -0.166719
C  7.565771 0.957549 -0.524173
C  -7.567926 0.965927 -0.455998
H  1.563361 1.222147 -0.624971
H  1.155476 1.206912 1.115581
H  -1.143839 1.211176 1.121447
H  -1.567263 1.220964 -0.615341
H  2.52765 -1.106942 -0.412661
H  2.146655 -1.088223 1.357188
H  -2.133808 -1.083061 1.379132
H  -2.531929 -1.106319 -0.386906
H  -0.002856 -0.733027 -0.836663
H  5.525867 1.698721 -1.030259
H  5.906914 1.710223 0.743795
H  -5.897059 1.717087 0.796736
H  -5.532068 1.705411 -0.98048
H  8.045455 0.377703 0.282404
H  7.701608 0.419984 -1.477921
H  8.085268 1.930497 -0.602873
H  -7.713214 0.43049 -1.409502
H  -8.040153 0.384553 0.353934
H  -8.087599 1.939336 -0.527176
