program: Gaussian 09
title: /home/michael/molsimp_comfiles/Mn_31a_25_OH/Mn_31a_25_OH.com auto generated
version: ES64L-G09RevE.01
frameworkgroup: C1[X(C23H16MnN5O5)]
method: UTPSSh
basis: Gen
operation: Freq
keyword: #P
keyword: Geom=AllCheck
keyword: Guess=TCheck
keyword: SCRF=Check
keyword: GenChk
keyword: UTPSSh/ChkBas
keyword: Freq
title: /home/michael/molsimp_comfiles/Mn_31a_25_OH/Mn_31a_25_OH.com auto gene
converged: YES YES NO YES
polarizability: 6.95759911e+02 -1.49647827e+01 5.05442549e+02 -8.01897961e+01 5.92012805e+01 5.18198536e+02
1716.lowfreq: -0.0006 -0.0004 0.0006 4.5912 10.3070 16.2878 22.1808 25.7473 31.2509
frequency: 16.8209 24.4873 31.1685 34.2775 38.1892 46.6386 76.2124 91.1698 111.0256 122.6159 133.5792 155.2458 159.0582 175.6954 176.3613 178.1006 182.2885 202.1412 225.2451 233.3243 241.0406 264.5187 272.2132 285.1791 291.9090 351.3977 353.8810 366.5770 389.3637 389.6738 398.8622 406.1218 421.5827 441.7682 453.0203 466.4039 476.0683 477.0952 491.1841 493.1427 529.6205 530.5554 544.7867 549.2064 557.8801 592.6971 629.2220 636.5788 640.0431 658.8860 662.0586 670.2342 685.9705 725.1574 763.3465 766.4693 767.1119 779.2185 780.3236 780.8474 791.5223 792.1471 793.0906 842.5048 845.5083 854.1132 857.4217 859.2054 890.9175 893.5185 896.8379 920.3702 964.2888 973.4755 974.3832 988.8427 990.9371 1001.2124 1001.5400 1023.3914 1028.0137 1033.7237 1034.0265 1039.5312 1049.6414 1091.5483 1098.0318 1104.6504 1138.1658 1155.6365 1156.8605 1165.7949 1172.9802 1174.9648 1178.7349 1184.7696 1186.8971 1250.9171 1254.5848 1266.9036 1284.6650 1285.9631 1321.1205 1324.2654 1327.0630 1339.0409 1340.3163 1400.3698 1437.9492 1438.8178 1451.3165 1451.9785 1453.2530 1487.1686 1488.7138 1512.9796 1536.9504 1537.5603 1580.8453 1582.3769 1616.3721 1617.5680 1624.0539 1636.3334 1659.3650 1659.4389 1670.2456 1697.8713 3212.6556 3213.9033 3219.7690 3220.8259 3228.2332 3229.5058 3234.2161 3234.8540 3235.8211 3237.2111 3240.6420 3249.6563 3254.7300 3260.4901 3271.1019 3714.2520
redmass: 5.5756 5.4683 5.9390 4.8861 8.1349 6.6294 10.0676 7.1876 6.5809 7.1991 7.6518 7.4206 8.4471 5.9752 4.9028 4.5974 4.1340 7.0231 6.1797 7.2855 7.9850 7.2786 9.8306 7.5420 10.3308 1.6380 8.3451 4.0363 3.6500 3.6091 4.9486 5.3411 12.2033 11.3318 4.0613 5.9052 3.1456 3.1529 3.6407 3.6815 7.0396 7.1537 8.0810 8.1619 11.1976 7.3530 14.3467 7.3849 7.3652 4.5967 4.6003 7.5468 7.6679 11.3851 1.3581 1.8452 1.4896 7.2591 5.5310 5.6809 3.7837 10.1629 3.4555 5.8686 5.5262 2.1852 1.3393 1.3120 1.1011 1.5024 1.4936 8.2294 1.3907 5.3323 5.2032 1.3218 1.3260 1.3603 1.3593 1.3272 1.3250 2.2896 2.2968 1.3589 5.5168 2.1260 3.1045 3.2135 4.6764 1.5139 1.5234 3.5345 1.1814 1.1753 1.2909 1.3877 1.3809 2.8097 2.7649 2.3352 1.7785 1.7754 3.4452 4.5988 4.5683 2.9636 2.9102 4.9138 5.3585 5.7378 2.9012 2.1385 2.2358 2.4231 2.4419 3.2210 3.0085 3.0010 6.7802 6.8561 5.7799 5.7669 7.7292 7.0156 5.6032 5.6002 13.0699 13.0043 1.0875 1.0874 1.0898 1.0897 1.0958 1.0958 1.0924 1.0986 1.0988 1.0927 1.0901 1.0935 1.0984 1.0967 1.0965 1.0655
irintensity: 0.2760 2.1667 7.6293 2.1715 0.2055 4.6969 18.9973 0.9077 1.5874 1.6215 5.3399 6.4102 0.7324 16.5943 0.9657 5.7261 11.6597 1.6293 12.8023 14.2651 6.2788 3.1512 84.0335 21.7163 34.3697 63.7510 164.6034 261.2964 4.1448 2.8936 3.6738 14.0608 68.9780 120.8205 12.7153 0.8621 14.1321 10.8932 2.7803 1.1651 0.3959 0.2198 2.6522 20.5374 4.2572 12.3954 535.7228 20.7502 3.1371 3.5081 3.9107 75.1481 78.1620 208.4638 53.9822 93.3140 15.4521 0.5170 17.4640 14.6799 14.8528 2.6495 11.1844 10.0831 6.0388 20.8170 82.4648 84.3951 166.7867 10.9428 10.0625 98.6408 0.0310 3.0485 1.8260 1.7671 0.6418 2.2810 3.3163 0.0160 0.0181 6.8734 5.9107 0.1430 68.4600 154.5145 33.9543 20.0416 236.8544 11.4968 15.5982 215.5619 8.1054 7.0150 24.2128 4.3785 5.1855 15.5548 7.7507 1.0821 0.5042 0.9233 291.8764 440.5073 399.0515 12.4865 2.4007 89.9496 113.7887 91.8288 33.4726 36.4574 21.5383 28.3878 1.5469 60.8600 12.5918 20.9858 50.9933 47.0500 74.4801 30.4449 38.2874 5.5588 4.8638 10.2951 1875.0611 815.6047 0.5313 0.4874 3.6519 3.0584 11.4186 12.1582 2.7190 14.5779 18.2782 2.2974 2.7117 4.9029 1.0269 5.9474 15.4428 290.9764
temp: 298.150 k
press: 1.00000 atm
elementType: 25 8 6 8 6 6 6 6 6 6 8 8 7 1 1 1 7 6 6 6 6 6 6 6 6 7 1 1 1 1 1 1 7 6 6 6 6 6 6 6 6 7 1 1 1 1 1 1 8 1
symmnumber: 1
zpe: 947073.3 jmol-1
zpe.correction: 0.360721 hartree
zpe.thermalcorrener: 0.388647 hartree
zpe.thermalcorrenthalpy: 0.389591 hartree
zpe.thermalcorrgfe: 0.299632 hartree
zpe.sumelectzpe: -1639.577829 hartree
zpe.sumelectthermal: -1639.549903 hartree
zpe.sumelectthermalent: -1639.548959 hartree
zpe.sumelectthermalfe: -1639.638918 hartree
dipole: 0.6721 12.0396 1.4251
dipole: 12.1422
quadrupole: -65.9079 -146.7585 -217.0207
quadrupole: 13.1650 3.6420 -18.4383
quadrupole: 77.3212 -3.5294 -73.7917 13.1650 3.6420 -18.4383
hfenergy: -1639.9385501 hartree
pointgroup: C01 [X(C23H16Mn1N5O5)]
dipole: -0.733537 4.6410963 -0.8620363 debye
polarizability: 690.9110593|28.6254796|501.6927204|-75.9384446|-65.8061949|526.797216 unknown
InChI: InChI=1S/2C8H6N2.C7H3NO4.Mn.H2O/c2*1-2-4-8-7(3-1)5-6-9-10-8;9-6(10)4-2-1-3-5(8-4)7(11)12;;/h2*1-6H;1-3H;;1H2/q2*-1;-3;+6;/p-1
charge 1 multiplicity 4
50 atoms
Mn 0.01127992 -1.18320581 -0.01052606
O  1.79637439 -2.07519746 3.47612578
C  1.51165525 -1.83282487 2.30327469
O  0.30589252 -1.48498643 1.89563305
C  2.50064858 -1.88996385 1.17820087
C  3.86019768 -2.18874946 1.21137364
C  4.57359069 -2.15438331 0.00623727
C  3.93242267 -1.82513734 -1.19510911
C  2.5707825 -1.53902706 -1.15037159
C  1.64556309 -1.16187022 -2.26412417
O  0.39184837 -0.98878387 -1.84765197
O  1.98164632 -1.03059083 -3.43571857
N  1.91804816 -1.5855071 0.01480574
H  4.3389729 -2.43643998 2.15131165
H  5.63337242 -2.382254 0.00363225
H  4.46600081 -1.7895997 -2.13740317
N  -1.89468124 -0.48501236 -0.36462117
C  -2.14989604 0.42891698 -1.34049577
C  -3.43660441 0.86839263 -1.56914035
C  -4.4764047 0.35635001 -0.77177722
C  -5.84202013 0.71608165 -0.90769877
C  -6.77923489 0.14881595 -0.07191454
C  -6.40198952 -0.79200216 0.92802287
C  -5.08742104 -1.16343357 1.0892229
C  -4.101494 -0.59414206 0.23785343
N  -2.81256174 -0.98883435 0.41016324
H  -1.2961645 0.76886904 -1.91081471
H  -3.63230769 1.59341832 -2.35144949
H  -6.12549708 1.43270681 -1.67127103
H  -7.82544311 0.41836404 -0.17265112
H  -7.16744057 -1.21894359 1.56725116
H  -4.78037343 -1.88010409 1.84296244
N  0.52438311 0.81295848 0.32827036
C  -0.03726632 1.46935753 1.38101763
C  0.30256082 2.77536818 1.66347441
C  1.24653848 3.41722306 0.84055511
C  1.69103338 4.75271398 1.01941582
C  2.6210606 5.28079535 0.15044654
C  3.14496239 4.51013105 -0.92595325
C  2.73775319 3.21208657 -1.12921524
C  1.78001174 2.64303897 -0.24568518
N  1.40119468 1.35682509 -0.46892167
H  -0.74979493 0.90362824 1.96737898
H  -0.15143187 3.28811186 2.50425016
H  1.28896284 5.33676093 1.84062227
H  2.96459631 6.30154256 0.28313125
H  3.87523191 4.95919603 -1.59071896
H  3.12507986 2.60874621 -1.9430761
O  -0.49694755 -2.89304011 -0.17450296
H  -0.56998384 -3.13042996 -1.11924837
