program: Gaussian 09
title: /home/michael/molsimp_comfiles/Mn_31a_23_OH/Mn_31a_23_OH.com auto generated
version: ES64L-G09RevE.01
frameworkgroup: C1[X(C25H20MnN4O3)]
method: UTPSSh
basis: Gen
operation: Freq
keyword: #P
keyword: Geom=AllCheck
keyword: Guess=TCheck
keyword: SCRF=Check
keyword: GenChk
keyword: UTPSSh/ChkBas
keyword: Freq
title: /home/michael/molsimp_comfiles/Mn_31a_23_OH/Mn_31a_23_OH.com auto gene
converged: YES YES YES YES
polarizability: 6.80979081e+02 2.42565660e+01 6.08246203e+02 1.35603692e+01 -3.38270272e+01 4.03642048e+02
1716.lowfreq: -12.3413 0.0007 0.0009 0.0010 8.1309 19.3689 22.9766 28.5414 39.2037
frequency: 21.7334 27.7518 39.0300 49.4310 50.7072 67.7655 86.8817 100.5087 111.8700 131.2965 135.3339 142.6393 167.6863 173.9376 178.3474 183.1310 194.7185 204.7338 209.5938 229.1848 245.0700 252.7881 283.3788 286.7556 292.6008 334.5601 346.1812 379.6996 390.9127 395.8549 404.4443 417.4909 436.4778 442.7347 456.7215 459.9673 475.3278 486.1608 512.5508 524.1412 553.3124 566.7163 579.5593 619.0200 639.9552 642.7018 646.6888 651.1800 653.1168 666.5179 695.9052 703.1930 713.8298 750.7731 763.2631 764.5500 768.1299 769.1089 774.6428 787.8263 794.8174 834.7212 837.8889 844.0500 877.0708 882.8648 885.9206 891.8088 917.4906 948.9295 952.4612 966.1608 977.2935 979.9408 991.7076 1004.2706 1013.1243 1021.5533 1032.7299 1033.0097 1034.1680 1034.6792 1036.3001 1040.1707 1047.5538 1049.6627 1065.0774 1077.7666 1089.0194 1108.8343 1110.2678 1113.0374 1134.6533 1157.5282 1160.0270 1173.7418 1177.8760 1188.8795 1197.4594 1211.9675 1236.1193 1251.6287 1278.8412 1282.5517 1304.5058 1326.0875 1328.3056 1344.9467 1377.5818 1381.2532 1390.7948 1392.5534 1414.6123 1433.8157 1444.4559 1479.6653 1480.3167 1489.7354 1493.2021 1500.7502 1526.3781 1541.3225 1542.8401 1603.5919 1610.1665 1616.5619 1619.2303 1639.3407 1640.9857 1646.8542 1651.6898 1665.2386 1701.5704 3206.2976 3211.8645 3220.3764 3227.4373 3227.7693 3229.3455 3233.9649 3234.8183 3237.7159 3239.4456 3243.8708 3245.8024 3249.0825 3250.5589 3251.9943 3256.0701 3256.9743 3260.0563 3280.8684 3719.8287
redmass: 4.8471 5.7144 5.5422 5.4340 4.9468 7.2106 4.5775 5.1989 4.3592 5.8614 2.4919 6.4167 4.9360 3.7702 5.2624 4.0836 6.4744 3.5788 4.6405 4.9763 5.9604 4.0845 7.4814 5.4326 7.8545 10.1312 11.0857 5.9536 6.0615 3.2326 2.7446 8.9273 3.8810 3.9467 4.1965 4.3476 2.9284 3.3516 8.3297 6.8009 7.6629 4.3618 6.6309 14.0356 3.8288 6.5109 7.0392 6.5027 7.0131 7.0390 7.9049 1.9316 5.3897 2.1245 1.3123 4.8166 1.6553 2.8495 3.4834 4.7457 1.5994 3.7904 1.5851 2.1943 1.4356 2.7278 1.2614 1.4131 1.3332 1.4101 1.4471 4.9924 1.3193 1.2889 1.3761 1.3899 1.3600 1.3159 6.6606 1.4091 5.1120 1.4289 1.3619 2.3804 6.0104 6.8589 2.7339 4.5426 1.7304 2.2377 1.7731 1.7537 2.8821 1.4971 1.7142 1.0704 1.1050 1.1647 1.3601 1.3275 1.2161 2.1871 2.8268 1.6730 1.8362 7.4760 6.3200 1.8673 2.5358 3.6047 1.3082 3.5511 1.6543 7.0656 2.4848 2.4447 2.4192 2.6399 2.0637 2.0986 1.9021 3.2497 3.0782 5.9955 5.9096 6.0586 5.1288 5.1040 6.1883 5.2542 5.1009 5.8685 13.0561 1.0870 1.0892 1.0955 1.0911 1.0890 1.0984 1.0924 1.0897 1.0901 1.0904 1.0951 1.0923 1.0951 1.0985 1.0954 1.0969 1.0960 1.0972 1.0920 1.0660
irintensity: 0.6627 3.6239 4.2421 3.4591 1.8087 1.6094 2.2135 3.0442 4.5940 1.1056 90.5586 4.6219 14.9770 13.6129 12.4971 18.7246 7.4930 24.7067 21.3996 4.0611 0.7845 29.2674 57.3049 5.7421 25.7316 35.8647 114.3637 21.4503 34.5047 5.7131 0.2887 102.5848 23.2623 18.5028 13.3053 3.4240 12.8152 26.8255 29.9890 0.3114 20.8886 0.7095 6.8198 357.1114 6.3737 28.3746 97.3083 13.5623 28.2066 25.1614 88.9091 94.4817 42.4400 3.1995 52.1277 32.6489 56.2858 56.2298 1.2290 5.7768 84.8404 27.7123 64.5223 22.5991 83.6943 111.6798 2.3986 10.5355 1.1693 0.0385 14.6506 5.0793 0.6431 4.5691 6.2129 1.0678 1.2485 0.0646 25.5201 1.3737 43.3189 2.8009 0.1797 13.9449 20.5110 53.7731 153.3796 23.0187 47.7733 129.3634 5.9667 12.6853 254.0184 2.9614 104.5994 1.5870 7.9152 0.1126 57.0542 63.2439 25.4474 9.6673 179.8075 4.0979 22.6224 6.4722 80.0174 52.7037 97.7922 5.2188 29.3060 70.4511 44.7121 95.4948 3.8090 18.6446 85.4136 100.1034 62.6734 147.1368 4.7332 15.3232 48.7381 4.7222 1.7233 6.2206 5.6884 42.1183 22.0950 24.4783 52.2778 133.0021 1366.4887 0.8575 0.3270 20.9059 4.9786 3.1088 27.4479 2.3708 3.5646 0.1353 2.9324 0.2243 1.2722 1.4773 1.5963 5.6021 4.0175 5.7036 4.1696 7.3028 305.2617
temp: 298.150 k
press: 1.00000 atm
elementType: 25 8 6 8 6 6 6 6 6 6 6 6 6 6 7 7 1 1 1 1 1 1 1 7 6 6 6 6 6 6 6 6 6 1 1 1 1 1 1 1 7 6 6 6 6 6 1 1 1 1 1 8 1
symmnumber: 1
zpe: 1069809.7 jmol-1
zpe.correction: 0.407469 hartree
zpe.thermalcorrener: 0.434870 hartree
zpe.thermalcorrenthalpy: 0.435815 hartree
zpe.thermalcorrgfe: 0.348434 hartree
zpe.sumelectzpe: -1512.835431 hartree
zpe.sumelectthermal: -1512.808030 hartree
zpe.sumelectthermalent: -1512.807086 hartree
zpe.sumelectthermalfe: -1512.894467 hartree
dipole: -8.7475 14.0577 7.3869
dipole: 18.1302
quadrupole: -46.5582 -147.6222 -156.2261
quadrupole: -1.6478 0.3632 -22.4694
quadrupole: 70.2440 -30.8201 -39.4239 -1.6478 0.3632 -22.4694
hfenergy: -1513.2429003 hartree
pointgroup: C01 [X(C25H20Mn1N4O3)]
dipole: -3.5237839 5.4059915 3.0393538 debye
polarizability: 680.2136115|25.1943408|610.389312|11.4320299|-30.3537808|402.2644085 unknown
InChI: InChI=1S/C11H7N2O2.C9H7N.C5H5N.Mn.H2O/c14-11(15)10-6-3-5-9(13-10)8-4-1-2-7-12-8;1-2-4-9-7-10-6-5-8(9)3-1;1-2-4-6-5-3-1;;/h1-7H;1-7H;1-5H;;1H2/q-3;2*-1;+6;/p-1
charge 2 multiplicity 4
53 atoms
Mn -0.44703866 -0.09228438 -0.65943574
O  -0.93935451 -3.97257177 -1.17386969
C  -1.09496987 -2.78198516 -0.93574486
O  -0.07460824 -1.92652277 -0.83503491
C  -2.41461861 -2.12061269 -0.70112566
C  -3.66943467 -2.71281151 -0.66944063
C  -4.77021657 -1.88747313 -0.4049105
C  -4.59886937 -0.517719 -0.19793933
C  -3.30780355 0.02110393 -0.25799724
C  -2.89939681 1.42305551 -0.14018954
C  -3.7480776 2.49656076 0.11515121
C  -3.21557189 3.78743281 0.14618267
C  -1.85432886 3.97478523 -0.08656258
C  -1.05046818 2.86204896 -0.32860669
N  -1.56280419 1.61967156 -0.33993215
N  -2.26947467 -0.80285735 -0.4902076
H  -3.77392936 -3.77716387 -0.84272096
H  -5.76652705 -2.31257907 -0.3662262
H  -5.44971025 0.12355149 -0.00383426
H  -4.80506244 2.32622321 0.28047027
H  -3.8627556 4.63455849 0.3433382
H  -1.40643313 4.96090321 -0.08376381
H  0.01302546 2.95821599 -0.51127238
N  1.55620364 0.26155044 -0.76095901
C  2.02287832 1.24882192 -1.59614372
C  3.36400198 1.50867934 -1.71546465
C  4.30757627 0.74179874 -0.98186404
C  5.7077763 0.94605707 -1.0575995
C  6.55841083 0.15231319 -0.31283026
C  6.05662971 -0.87180685 0.53252128
C  4.70033389 -1.09637342 0.62828701
C  3.80377713 -0.29267822 -0.1275504
C  2.40803574 -0.48193095 -0.05452039
H  1.27395274 1.79867605 -2.15116417
H  3.69783637 2.29808822 -2.38004958
H  6.09524926 1.7274733 -1.703482
H  7.6306487 0.3109003 -0.371261
H  6.75082845 -1.47813157 1.10496681
H  4.30083896 -1.8748056 1.27070142
H  1.99017948 -1.2522416 0.58442743
N  -0.23775388 -0.15566946 1.41227753
C  0.34664369 0.89521091 2.03441241
C  0.51771926 0.93122038 3.41218098
C  0.0790645 -0.14945272 4.17962059
C  -0.51299016 -1.23550735 3.53427825
C  -0.65514107 -1.2069001 2.15169171
H  0.69123971 1.71255225 1.4119949
H  0.99094323 1.79515118 3.86346916
H  0.20043531 -0.14631173 5.25738895
H  -0.86436058 -2.10152216 4.08256323
H  -1.10602307 -2.04016488 1.63009639
O  -0.6203004 0.09396137 -2.4292992
H  -0.95419669 0.97774249 -2.67573575
