program: Gaussian 09
title: 000031835
version: EM64L-G09RevD.01
frameworkgroup: C1[X(C9H10O3)]
method: RPBEPBE
basis: SDD
operation: Freq
keyword: #pfreq=noraman
keyword: PBEPBE/SDD
title: #p freq=noraman PBEPBE/SDD
converged: NO YES NO NO
title: Mulliken charges:
elementType: O O O C C C C C C C C C H H H H H H H H H H
charge: -0.409769 -0.272711 -0.339220 0.355117 0.089692 0.026169 -0.384567 -0.335878 -0.233359 -0.776671 0.231086 -0.497378 0.236186 0.267250 0.230244 0.210800 0.243416 0.243517 0.388475 0.245789 0.245885 0.235926
chargesum: 0.00000
title: Mulliken charges with hydrogens summed into heavy atoms:
elementType: O O O C C C C C C C C C
charge: -0.021294 -0.272711 -0.339220 0.355117 0.089692 0.026169 -0.148381 -0.068628 -0.003115 -0.078938 0.231086 0.230221
polarizability: 1.58052997e+02 1.32533531e+00 1.20686682e+02 2.31828030e-02 5.72301946e-03 5.31777864e+01
1716.lowfreq: -9.9609 -3.6502 -0.0006 -0.0006 0.0005 10.7756 69.1938 93.0225 104.8671
frequency: 69.1766 92.9868 104.8644 133.6973 150.7284 152.0485 219.5368 276.2434 277.2042 323.5043 353.3157 427.6885 474.4394 482.4333 546.9961 548.5462 614.6010 690.0904 734.5735 754.6433 798.3033 813.5211 852.7555 858.7374 927.5235 953.2174 979.1989 1007.1392 1049.4832 1085.0028 1114.3487 1126.1018 1153.0273 1174.7926 1234.9136 1266.6650 1289.0657 1370.2914 1400.7304 1410.2067 1421.5234 1429.6954 1452.8669 1453.0039 1454.6775 1463.2068 1479.8176 1560.6700 1600.6185 1632.6491 2985.7422 3006.4320 3009.1147 3064.3577 3094.9761 3112.5798 3127.6340 3153.5568 3154.0110 3177.3976
redmass: 4.0090 1.1512 1.0405 4.4193 3.9778 3.6650 3.6115 3.2394 4.4905 4.9392 5.2185 9.8276 4.1742 4.9928 3.4102 4.7625 6.6769 6.3629 5.9848 2.2992 1.8295 6.1360 5.1222 1.0889 1.3487 3.7045 1.3416 2.0242 1.5266 1.7737 1.2594 2.9392 1.5951 1.2039 3.0139 2.2276 2.8990 2.1227 1.4078 2.5634 1.6407 2.5059 1.0629 2.0572 1.0447 1.0647 1.2118 4.9810 5.3138 4.6171 1.0366 1.0637 1.0340 1.0967 1.1004 1.1048 1.0887 1.0919 1.1044 1.0978
irintensity: 2.4551 0.6269 0.3624 2.1991 1.5572 1.9103 5.5686 5.7204 1.0382 2.0558 25.7543 4.6509 5.2948 0.6910 0.5501 12.9632 7.4290 1.5417 0.1100 48.8976 33.7208 12.0255 4.9400 127.1476 0.5018 24.3131 0.2004 24.0380 8.0670 39.8447 0.0602 148.9870 110.7955 15.5895 4.8250 67.4678 333.2802 121.8757 52.6394 100.7840 59.0264 84.0351 13.6368 4.7899 13.8915 12.1591 27.8247 58.3779 21.5959 124.4733 34.3289 335.7342 0.8443 15.4142 17.3796 23.7884 11.6771 10.7624 16.3187 10.2152
temp: 298.150 k
press: 1.00000 atm
elementType: 8 8 8 6 6 6 6 6 6 6 6 6 1 1 1 1 1 1 1 1 1 1
symmnumber: 1
zpe: 449358.5 jmol-1
zpe.correction: 0.171152 hartree
zpe.thermalcorrener: 0.182700 hartree
zpe.thermalcorrenthalpy: 0.183644 hartree
zpe.thermalcorrgfe: 0.133618 hartree
zpe.sumelectzpe: -573.761170 hartree
zpe.sumelectthermal: -573.749622 hartree
zpe.sumelectthermalent: -573.748677 hartree
zpe.sumelectthermalfe: -573.798704 hartree
dipole: -1.1779 2.0072 0.0130
dipole: 2.3273
quadrupole: -52.9558 -71.8726 -72.3522
quadrupole: 0.4389 -0.0167 -0.0056
quadrupole: 12.7711 -6.1457 -6.6253 0.4389 -0.0167 -0.0056
hfenergy: -573.9323217 hartree
pointgroup: C01 [X(C9H10O3)]
dipole: 0.4416935 0.8018581 0.0184657 debye
dipolederiv: -0.4858646 0.2271542 0.0101946 0.0587245 -1.1710355 -0.03211 0.0041571 -0.0350251 -0.3781122 -1.6410091 -0.2118709 0.0156475 -0.6593311 -0.5487624 0.0013421 -0.0018129 -0.0065977 -0.2891003 -0.8594587 0.1791526 0.0155611 0.1680179 -0.976783 -0.0267689 0.0144711 -0.0281624 -0.3485374 0.1804677 0.5401637 0.0173525 0.2101972 -0.1437702 -0.0072021 0.0048924 -0.0125773 -0.0482955 -0.9917578 0.0431091 0.0174462 0.4200362 -0.2675936 -0.0155662 0.0320259 -0.0092897 -0.0522044 0.2394029 -0.5069483 -0.0224225 0.0629152 0.9830586 0.035155 -0.0008353 0.0453348 0.0667031 0.1944325 -0.0011552 -0.0054319 0.1054824 0.1664665 0.0100505 -0.0015486 0.0119794 -0.1412772 0.2694016 0.0290492 -0.0050746 -0.4717157 0.0462357 0.014 -0.0240709 0.0060135 -0.1123507 -0.4936106 -0.1159162 0.0007111 -0.0629376 0.0514612 0.0098428 0.0026256 0.0103814 -0.1863944 0.0298348 -0.1018955 -0.0036959 -0.1613209 -0.0823231 -0.0027388 -0.0065921 -0.0043031 0.0578875 2.2752125 -0.0636715 -0.0365989 0.2529998 1.1494474 0.0294336 -0.0241685 0.0358424 0.2592439 0.8319996 0.0282622 -0.0090839 -0.0620337 0.2216882 -0.0010557 -0.0128896 -0.0027333 0.278139 -0.1122473 0.0637623 0.0066355 0.0481818 0.0851546 -0.0031002 0.0062607 -0.0033139 0.1459852 0.0430209 -0.0833332 -0.001407 -0.0671843 0.0475913 -0.0031521 -0.0009109 -0.002943 0.1581746 0.0634342 0.0362256 0.0030807 0.043593 -0.1167577 -0.0115544 0.0033251 -0.0112094 0.1679703 -0.1254427 0.0330951 0.0054451 0.149568 0.0272749 -0.0057838 0.0099918 -0.0036547 0.1061082 0.0585537 -0.0165456 0.0313242 -0.0465192 0.0328194 -0.0953165 -0.0300516 -0.108751 -0.0404255 0.0585583 -0.0098153 -0.0354886 -0.0450549 0.0160926 0.1014078 0.0233466 0.1136901 -0.0229921 0.5367169 0.0128969 -0.002186 0.0000879 0.4139527 0.002361 -0.0023723 0.0018957 0.3576144 -0.0251343 -0.0104474 -0.0080952 0.0915764 0.0587041 -0.095592 0.0475959 -0.0747509 -0.0582371 -0.0264962 -0.0077076 0.0058926 0.0990994 0.0446187 0.1001223 -0.0409722 0.0832424 -0.0424461 -0.0200144 -0.0635641 0.0001934 -0.1343824 -0.0375402 -0.0037746 -0.0024673 -0.0050682 0.1225465 unknown
polarizability: 158.0679022|-0.2429103|120.5409744|-1.7686771|2.612271|53.3085891 unknown
InChI: InChI=1S/C9H10O3/c1-6-4-3-5-7(8(6)10)9(11)12-2/h3-5,10H,1-2H3
charge 0 multiplicity 1
22 atoms
O  -0.607092 -2.024518 -0.142029
O  2.637277 0.710842 -0.089436
O  1.921844 -1.498164 -0.163423
C  -2.167443 -0.204634 -0.044619
C  0.273109 0.278319 -0.06561
C  -0.815398 -0.659186 -0.084284
C  -2.394305 1.185061 0.012033
C  -0.001524 1.674454 -0.00787
C  -1.32765 2.12599 0.031101
C  -3.292674 -1.215392 -0.065929
C  1.641865 -0.25007 -0.10907
C  4.029967 0.200983 -0.13751
H  -3.430035 1.544323 0.04244
H  0.838738 2.374176 0.00557
H  -1.545239 3.197717 0.075142
H  -4.275999 -0.716848 -0.028777
H  -3.246077 -1.840815 -0.976223
H  -3.215664 -1.912531 0.788419
H  0.400648 -2.189665 -0.168064
H  4.192263 -0.374734 -1.06368
H  4.228598 -0.446481 0.7325
H  4.654992 1.104173 -0.113983
