program: Gaussian 09
title: 000031928
version: EM64L-G09RevD.01
frameworkgroup: C1[X(C22H35N3)]
method: RPBEPBE
basis: SDD
operation: Freq
keyword: #pfreq=noraman
keyword: PBEPBE/SDD
title: #p freq=noraman PBEPBE/SDD
converged: YES YES NO NO
title: Mulliken charges:
elementType: N N N C C C C C C C C C C C C C C C C C C C C C C H H H H H H H H H H H H H H H H H H H H H H H H H H H H H H H H H H H
charge: -0.103402 -0.111265 -0.100720 -0.102987 -0.146814 -0.422508 -0.409535 -0.403517 -0.380149 -0.394741 -0.417365 0.029996 -0.475740 -0.366589 -0.369063 -0.787256 -0.391995 -0.395487 -0.402081 0.458706 -0.369988 -0.451856 -0.233659 -0.222787 -0.245967 0.198331 0.210533 0.192680 0.194765 0.196493 0.201737 0.203127 0.191550 0.192205 0.219987 0.194154 0.231951 0.203968 0.207052 0.183067 0.190965 0.217114 0.161248 0.228317 0.169663 0.203746 0.210281 0.222250 0.249343 0.201946 0.189007 0.204613 0.188003 0.212648 0.187968 0.251996 0.232180 0.223946 0.223671 0.226260
chargesum: 0.00000
title: Mulliken charges with hydrogens summed into heavy atoms:
elementType: N N N C C C C C C C C C C C C C C C C C C C C C C
charge: -0.103402 -0.111265 -0.100720 0.095344 0.063719 -0.035064 -0.011305 -0.008840 0.032044 0.031363 -0.006345 0.213063 -0.067660 0.022977 0.004346 -0.105382 -0.001042 -0.002870 -0.001465 0.458706 -0.117991 -0.219675 -0.009712 0.000884 -0.019707
polarizability: 3.26182154e+02 6.19184993e+00 2.32739925e+02 1.92777690e+01 -5.29155812e+00 1.93473560e+02
1716.lowfreq: -14.4334 -10.0166 -4.3470 -0.0006 -0.0003 0.0007 13.4821 18.4184 25.5423
frequency: 9.1346 18.0965 21.3284 37.6096 39.1803 53.5208 80.9353 102.7772 137.2230 148.3929 171.4474 173.6600 213.9586 229.8218 251.0699 263.9984 274.9136 286.6982 306.7922 318.7880 327.9171 341.8356 371.6928 373.1632 392.1171 400.5798 405.5710 435.1882 439.9940 445.2173 449.9290 468.7371 479.9996 507.8347 565.7617 577.6155 600.9468 616.7955 674.0300 703.7805 707.6756 733.0094 751.5017 766.0716 787.8032 795.0674 807.2168 815.8264 826.1267 844.8982 853.5870 856.5334 859.4601 875.4200 901.2157 910.6805 912.7501 943.0788 944.9618 955.8009 961.2548 961.9558 968.8884 981.0439 989.9689 995.0728 1002.9727 1012.6635 1020.7858 1025.0594 1048.3346 1058.3561 1067.4408 1070.9953 1087.6857 1096.3358 1101.1141 1111.9881 1118.4854 1119.9306 1126.4927 1134.4372 1146.8751 1150.2790 1154.3854 1161.9814 1169.1474 1179.5257 1187.0501 1198.0363 1211.8346 1226.3189 1230.4552 1248.6852 1254.3687 1258.6620 1265.2804 1269.0129 1275.5113 1290.7378 1293.8860 1302.8421 1307.4382 1311.2147 1320.7023 1330.9802 1332.0093 1332.6202 1340.6381 1342.5001 1345.0467 1350.6150 1352.2362 1353.9355 1357.8030 1364.6641 1370.4202 1379.1725 1383.1012 1385.5157 1393.8021 1439.3197 1449.4407 1451.4631 1451.5386 1454.6416 1459.1303 1460.8153 1463.4605 1466.6136 1468.8134 1471.0949 1473.2875 1476.6209 1482.3105 1482.7346 1491.7805 1593.8256 1614.3396 2809.0437 2816.6836 2833.1120 2837.0949 2845.2684 2858.4048 2922.4423 2960.9704 2963.3170 2964.3803 2975.4011 2980.6814 2983.1426 2983.9081 2985.2476 2993.5006 3000.7807 3007.5881 3018.8738 3020.5998 3023.5836 3026.9658 3031.8568 3032.5635 3042.7275 3052.1086 3068.6152 3070.8734 3073.6436 3083.7842 3112.2435 3121.9377 3135.2053 3146.5710 3161.0227
redmass: 3.9675 3.8660 4.1261 3.1834 4.0271 3.8883 4.1350 2.8375 3.2503 2.9132 2.9909 4.0498 3.1179 2.3245 2.4838 2.2409 2.7512 2.4529 1.9939 1.9733 1.7710 1.8003 2.5022 2.2126 1.7645 2.2946 2.8176 2.5738 3.0199 2.9521 3.0700 2.5426 2.7641 2.9157 1.9811 2.5155 3.9033 6.3115 4.9460 2.2966 3.3864 1.8698 3.0656 2.2102 2.5870 2.8898 1.4733 3.3975 2.9615 2.9618 1.4258 1.4717 1.2798 2.2970 1.7249 2.1466 1.4121 2.2521 1.7895 1.7325 1.4989 1.8240 1.8814 1.3811 5.8541 1.3863 2.3683 2.1991 2.1051 2.1172 1.8777 1.7619 1.7848 1.8290 1.7480 1.6947 2.4034 1.7968 2.2643 2.1840 1.9636 1.9842 1.5229 1.4361 2.9959 2.1690 1.0611 1.1126 1.4529 1.8447 2.5799 1.3258 2.0325 1.3405 1.2935 1.2631 1.3454 1.2202 1.4563 1.1566 1.3819 1.4847 1.5414 1.3807 1.3752 1.2854 1.3446 1.3750 1.3741 1.4461 1.4091 1.4294 1.4144 1.4131 1.3609 1.4801 1.5015 2.2988 1.3834 1.4459 1.9408 2.0360 1.0879 1.0849 1.0858 1.0934 1.1073 1.0884 1.0823 1.0916 1.0915 1.1353 1.0850 1.0817 2.1247 1.0707 1.0555 6.1538 6.1754 1.0721 1.0731 1.0710 1.0780 1.0710 1.0693 1.0664 1.0629 1.0617 1.0623 1.0361 1.0858 1.0609 1.0617 1.0681 1.0834 1.0852 1.0896 1.0967 1.0991 1.0914 1.0904 1.0939 1.0887 1.1030 1.1031 1.0881 1.0968 1.0983 1.0987 1.0868 1.0861 1.0914 1.0953 1.1013
irintensity: 0.0353 0.1076 0.0337 0.1324 0.0608 0.1529 0.4946 0.1257 2.3386 1.0718 0.2023 2.1090 0.1854 0.5738 0.1619 1.6476 1.4025 1.1548 1.3110 2.7530 2.6145 0.4118 0.8646 2.0392 2.0250 1.6474 0.4418 1.9645 2.6263 0.2484 4.4334 3.4403 8.7456 0.4137 5.1137 1.8958 2.8078 0.1673 0.0104 30.6045 6.1038 36.8624 9.5490 36.3247 2.9661 15.7067 0.0488 3.6268 6.9270 1.2658 4.1558 1.0797 0.3383 12.6251 1.8775 3.3929 6.7638 21.2107 14.9335 1.9127 4.2971 2.1222 1.9374 0.4078 0.0078 0.2468 39.7088 21.8861 1.9998 7.5515 21.6327 6.3798 10.9607 31.7209 35.5225 1.7920 5.6174 8.2328 8.6375 19.2623 18.9358 5.1609 3.4866 2.4106 24.6237 81.2180 0.5138 1.9994 2.9542 6.4908 7.6728 4.5309 28.1156 11.6775 6.7046 4.6215 19.4277 6.1576 3.1773 7.2485 22.5604 1.1789 14.3303 1.7448 3.6499 10.9238 0.2201 4.3688 8.1972 0.8879 2.4566 7.3930 3.8372 4.2897 0.1226 4.1448 19.9406 5.9492 17.8493 4.6570 2.0968 15.3636 6.4145 1.1037 8.1824 6.0264 9.7972 10.4056 5.7698 12.9927 16.5850 14.2483 8.1913 5.7571 13.2535 2.8878 5.0912 1.0115 6.8257 38.2805 103.6542 54.5223 126.3886 55.8034 175.5915 60.4813 32.5485 23.4420 38.8363 30.4223 21.0456 46.0445 21.1410 107.6775 65.0054 53.9811 21.3845 59.9000 38.6356 25.1046 73.1742 56.5380 41.2792 24.3925 86.3586 30.4757 56.4647 37.6502 26.6738 8.1698 0.0783 19.8850 37.0418 27.5114
temp: 298.150 k
press: 1.00000 atm
elementType: 7 7 7 6 6 6 6 6 6 6 6 6 6 6 6 6 6 6 6 6 6 6 6 6 6 1 1 1 1 1 1 1 1 1 1 1 1 1 1 1 1 1 1 1 1 1 1 1 1 1 1 1 1 1 1 1 1 1 1 1
symmnumber: 1
zpe: 1401740.2 jmol-1
zpe.correction: 0.533895 hartree
zpe.thermalcorrener: 0.557425 hartree
zpe.thermalcorrenthalpy: 0.558370 hartree
zpe.thermalcorrgfe: 0.478212 hartree
zpe.sumelectzpe: -1021.607965 hartree
zpe.sumelectthermal: -1021.584435 hartree
zpe.sumelectthermalent: -1021.583491 hartree
zpe.sumelectthermalfe: -1021.663648 hartree
dipole: 0.4418 -0.1310 0.6345
dipole: 0.7842
quadrupole: -150.8246 -150.0383 -152.6896
quadrupole: 1.7781 5.1874 -1.0090
quadrupole: 0.3595 1.1459 -1.5054 1.7781 5.1874 -1.0090
hfenergy: -1022.1418601 hartree
pointgroup: C01 [X(C22H35N3)]
dipole: 0.174009 0.1228005 -0.2232206 debye
polarizability: 325.961269|-1.0355109|232.2097715|-20.8431702|7.221189|194.2245992 unknown
InChI: InChI=1S/C22H35N3/c1-19(24-13-6-3-7-14-24)15-25-21-11-8-12-22(25)18-23(17-21)16-20-9-4-2-5-10-20/h2,4-5,9-10,19,21-22H,3,6-8,11-18H2,1H3
charge 0 multiplicity 1
60 atoms
N  0.683458 0.116687 0.228785
N  -2.053795 0.345689 -0.676218
N  4.466216 0.262589 0.297183
C  0.341814 -0.22485 -1.185559
C  -0.425928 -0.346688 1.114087
C  0.175073 -1.762078 -1.395173
C  -0.623064 -1.891409 1.042168
C  -0.901952 0.607951 -1.575817
C  -1.682762 0.47941 0.756056
C  -0.836015 -2.402532 -0.407357
C  2.053549 -0.242281 0.659497
C  3.088324 0.85252 0.254269
C  -3.229475 1.169969 -1.033832
C  5.579531 1.224199 0.506551
C  4.734987 -0.565806 -0.909826
C  2.896744 2.074625 1.17174
C  6.915963 0.47781 0.711449
C  6.037989 -1.37725 -0.764454
C  7.233561 -0.437704 -0.491841
C  -4.529726 0.690195 -0.394584
C  -4.834339 -0.69312 -0.324167
C  -5.478617 1.622038 0.092668
C  -6.061936 -1.133392 0.216718
C  -6.711519 1.185692 0.631289
C  -7.007749 -0.194956 0.694712
H  1.171406 0.126171 -1.830679
H  -0.156765 -0.076991 2.154563
H  1.168863 -2.23816 -1.264113
H  -0.132009 -1.963753 -2.440345
H  -1.476266 -2.192744 1.68128
H  0.28234 -2.367202 1.472944
H  -1.207855 0.366101 -2.612632
H  -0.600621 1.686519 -1.546915
H  -1.463985 1.548384 1.010391
H  -2.540752 0.152718 1.3719
H  -0.738382 -3.506066 -0.43452
H  -1.858751 -2.144621 -0.729472
H  2.388914 -1.23212 0.277716
H  2.064783 -0.320594 1.763554
H  2.850345 1.18331 -0.790667
H  -3.073094 2.250356 -0.776615
H  -3.332596 1.123494 -2.137669
H  5.686085 1.924247 -0.366271
H  5.365739 1.837254 1.396907
H  4.810036 0.085978 -1.822712
H  3.88515 -1.252348 -1.075789
H  3.203613 1.844366 2.209677
H  3.453786 2.96342 0.827317
H  1.820016 2.321335 1.17227
H  6.838058 -0.13412 1.631202
H  7.726447 1.216659 0.866144
H  5.922813 -2.086881 0.077591
H  6.20779 -1.969916 -1.684456
H  8.155632 -1.020842 -0.306571
H  7.420714 0.188123 -1.389537
H  -4.091839 -1.411533 -0.68944
H  -5.250749 2.694909 0.052542
H  -6.283659 -2.205944 0.264979
H  -7.434829 1.9198 1.004627
H  -7.961011 -0.536318 1.114156
