program: Gaussian 16
title: li4moiety_opt_freq_wb97xd_def2tzvpp
version: EM64L-G16RevB.01
method: RwB97XD
basis: def2TZVPP
operation: Freq
keyword: #N
keyword: Geom=AllCheck
keyword: Guess=TCheck
keyword: SCRF=Check
keyword: GenChk
keyword: RwB97XD/def2TZVPP
keyword: Freq
hfenergy: -2080.5855761 hartree
pointgroup: C01 [X(C36H36Li4N12)]
dipole: -2.9036777 0.6289567 0.4078229 debye
polarizability: 1256.1580188|45.4651802|1437.6394974|11.8644997|-0.6456714|348.1728497 unknown
InChI: InChI=1S/C36H20N12.4Li.16H/c1-2-10-22-21(9-1)29-37-17-39-31-23-11-3-4-12-24(23)33(46-31)41-19-43-35-27-15-7-8-16-28(27)36(48-35)44-20-42-34-26-14-6-5-13-25(26)32(47-34)40-18-38-30(22)45-29;;;;;;;;;;;;;;;;;;;;/h1-20H;;;;;;;;;;;;;;;;;;;;/q-4;4*+1;;;;;;;;;;;;;;;;
charge 0 multiplicity 1
88 atoms
C  -7.80262677 2.16763233 0.10511752
C  -8.06276057 0.79915501 0.08795493
C  -6.49995549 2.65231006 0.14923029
C  -5.48419126 1.72018416 0.19116618
C  -5.74219361 0.36296112 0.1742228
C  -7.02881874 -0.13038904 0.11451226
C  -4.01463175 1.85973155 0.22870695
C  -4.42706806 -0.30672638 0.20423493
N  -3.42583134 0.62485274 0.2990813
H  -8.63068874 2.86322399 0.07654061
H  -6.28381823 3.71163428 0.14631068
H  -9.08809435 0.45668594 0.04627743
H  -7.21611772 -1.19479506 0.08538958
C  -1.84099939 -4.05807879 -0.30676991
C  -1.73026588 -5.51042477 -0.21136388
C  -0.3669482 -5.77828016 -0.15544451
C  0.31362941 -4.48543233 -0.23994056
N  -0.65515989 -3.47674261 -0.36077211
C  -2.67605171 -6.51954919 -0.1495865
C  -2.20954615 -7.81981719 -0.03299458
C  -0.8402719 -8.09039054 0.027658
C  0.10185557 -7.07390726 -0.02956255
H  -3.73304379 -6.29619977 -0.19625356
H  -2.9133834 -8.63997196 0.01218608
H  1.16287359 -7.27529571 0.02109943
H  -0.51087975 -9.11682584 0.12138324
C  4.10342916 -1.87536875 0.0522421
N  3.51668381 -0.65084874 0.02244881
C  4.50483178 0.27648762 0.0505639
C  5.78715152 -0.36188439 0.12504571
C  5.52981165 -1.74161851 0.12553028
C  6.57515151 -2.6659261 0.18083851
C  7.09487196 0.12476968 0.18019944
C  8.1187908 -0.79297429 0.24269869
C  7.86066375 -2.17782039 0.24287697
H  7.28555975 1.18935072 0.17618658
H  9.14411865 -0.45010498 0.29200514
H  6.37038177 -3.72787822 0.17713686
H  8.69380334 -2.86688453 0.29207578
C  1.91041198 4.07373636 -0.24284935
N  0.64448883 3.47762409 -0.34985061
C  -0.2556981 4.44291638 -0.27853443
C  0.36723767 5.76091618 -0.18649046
C  1.73671519 5.52535246 -0.15133082
C  -0.15615177 7.03991427 -0.1120521
C  0.74485582 8.08853359 -0.00419367
C  2.12099689 7.85335376 0.03568998
C  2.63818678 6.56773629 -0.03409338
H  2.79595495 8.6945254 0.12309586
H  3.70192029 6.37768178 0.00100555
H  -1.22392389 7.20782019 -0.1425933
H  0.38001047 9.10536507 0.05049799
C  -3.18388904 -2.26642146 0.1766298
C  2.20733453 -3.15116001 -0.22704849
C  3.20176523 2.15052552 -0.24669251
C  -2.14384064 3.24238832 0.21825398
N  -4.33644495 -1.59124071 0.05999202
N  -3.03375816 -3.4277827 -0.36187624
N  1.59035692 -4.35185492 -0.16006034
N  3.46971136 -3.06124371 0.0331456
N  4.34179182 1.613602 0.0310404
N  3.05540704 3.4939254 -0.17399722
N  -1.59372038 4.27955464 -0.31586917
N  -3.46102472 3.02531726 0.10593905
H  -2.37284641 -1.86744753 0.80579291
H  1.63680385 -2.25610209 -0.51616836
H  2.35349461 1.5219499 -0.55681324
H  -1.52339545 2.57375113 0.83692676
H  1.2764802 1.90576022 -2.79099075
H  1.24554776 1.16251638 -2.707724
H  2.27043211 -1.75248235 2.35919349
H  1.52550714 -1.72365379 2.42187632
H  -1.20654949 -1.20327919 2.61216796
H  -1.86798651 -1.08595119 2.94532294
H  1.99305597 1.11859223 2.38110592
H  2.7042366 0.88749671 2.35104609
Li 0.17866509 1.63561342 -0.8439373
Li 1.71642923 -0.31280653 0.71176221
Li -0.41068906 -1.59550754 -0.8683417
Li -1.59566647 0.27125626 0.90696671
H  -1.89730655 1.45093519 2.87212215
H  -1.15526892 1.4237236 2.77623717
H  -1.52984914 1.59266399 -2.1888534
H  -1.32515394 2.27319941 -2.42844513
H  -2.02612888 -1.68430306 -2.46197306
H  -1.97272168 -0.96797921 -2.2472419
H  0.56947475 -2.23748641 -2.78412422
H  0.80323219 -1.53178086 -2.69621965
