program: Gaussian 09
title: 000031913
version: EM64L-G09RevD.01
frameworkgroup: C1[X(C18H29N3)]
method: RPBEPBE
basis: SDD
operation: Freq
keyword: #pfreq=noraman
keyword: PBEPBE/SDD
title: #p freq=noraman PBEPBE/SDD
converged: YES YES NO NO
title: Mulliken charges:
elementType: N N N C C C C C C C C C C C C C C C C C C H H H H H H H H H H H H H H H H H H H H H H H H H H H H H
charge: -0.096540 -0.112350 -0.077527 -0.111634 -0.159736 -0.427541 -0.406516 -0.383346 -0.390051 -0.393895 -0.375663 -0.475983 -0.365444 0.457952 -0.371328 -0.451583 -0.612493 -0.621039 -0.233354 -0.222727 -0.246220 0.197511 0.206525 0.198153 0.198962 0.201189 0.192807 0.219613 0.195703 0.191819 0.202105 0.193981 0.230859 0.202378 0.210399 0.217438 0.191748 0.190767 0.209704 0.253214 0.232002 0.224477 0.186293 0.219383 0.232270 0.219054 0.185200 0.223840 0.223495 0.226126
chargesum: 0.00000
title: Mulliken charges with hydrogens summed into heavy atoms:
elementType: N N N C C C C C C C C C C C C C C C C C C
charge: -0.096540 -0.112350 -0.077527 0.085878 0.046789 -0.030426 -0.012520 0.031971 0.003873 0.030945 0.037114 -0.066796 0.035028 0.457952 -0.118115 -0.219581 0.017660 0.015484 -0.009514 0.000769 -0.020094
polarizability: 2.53787961e+02 1.63513105e+01 1.88006413e+02 1.59348010e+01 -8.36981472e+00 1.81279222e+02
1716.lowfreq: -18.1831 -11.3940 -9.5785 -0.0004 0.0005 0.0006 21.1721 26.1430 27.9127
frequency: 19.3246 25.6863 27.8776 32.0845 57.0334 62.7738 108.4750 132.7422 148.4687 175.7585 195.2477 214.1304 223.9499 236.8940 253.1036 270.9418 288.9100 313.6204 322.4320 335.4231 355.7294 392.3650 401.7643 405.7704 428.4153 436.9020 468.2877 476.9346 514.7843 573.3482 598.1836 616.0161 674.4417 704.3098 714.4487 733.4975 766.8195 777.7016 786.2044 799.9275 815.4415 827.2360 829.5700 854.7418 858.4453 911.9357 938.6335 944.2821 960.1995 966.4929 980.7052 990.0209 994.5677 1002.1639 1013.2898 1019.6784 1024.1280 1032.4807 1043.9807 1065.3660 1070.9718 1085.5792 1088.4398 1091.6580 1096.3356 1106.0499 1128.7667 1133.1192 1145.9024 1154.5874 1168.2391 1168.8795 1179.0821 1191.1773 1207.4281 1210.6748 1230.8969 1246.6983 1254.4138 1256.8373 1265.8027 1269.9730 1287.3101 1299.5871 1307.0444 1312.2694 1320.1343 1332.3550 1334.1723 1341.8224 1352.2131 1355.3174 1360.8870 1369.2234 1378.0675 1380.1416 1392.2361 1417.5636 1438.4345 1441.1461 1447.3377 1452.3469 1455.6594 1459.0922 1460.3305 1461.6707 1469.9102 1471.2646 1473.6870 1476.5673 1482.1123 1484.1722 1488.2330 1593.4097 1614.0189 2834.7965 2839.0954 2846.5653 2848.6678 2859.3780 2866.5129 2911.4885 2961.0614 2968.0766 2979.3141 2986.0032 2993.1179 3002.9886 3006.2408 3009.6042 3015.1616 3018.5419 3022.0504 3025.2998 3032.1677 3032.9348 3070.9914 3074.3454 3081.9688 3112.6993 3121.9096 3135.0698 3146.1986 3160.9068
redmass: 3.8429 2.9514 3.7334 3.6287 3.8186 3.5737 2.1997 3.1748 2.5538 3.0822 3.2086 1.8844 1.7250 1.5011 1.6532 2.2145 2.4672 2.1408 3.1839 2.2831 2.2444 1.8518 3.0994 2.8376 2.5699 2.9741 2.9419 3.2250 3.7376 2.2601 4.4212 6.3239 4.9037 2.1963 3.7686 1.8666 2.2265 2.0681 2.6176 1.6588 3.2583 3.0013 3.3108 1.4963 1.2719 1.3945 1.8406 2.2498 1.9389 1.9624 1.3813 5.8956 1.4032 2.2382 2.3765 2.4055 2.1125 1.5185 1.7865 2.4976 1.8115 1.5189 1.7492 1.4220 1.6795 2.2535 1.9125 1.5528 1.6688 3.6788 1.1063 1.3618 1.1104 1.3717 2.0122 2.3590 1.6802 1.3714 1.6212 1.2909 1.9944 1.5150 1.2768 1.4005 1.6734 1.2719 1.3772 1.3280 1.3934 1.3423 1.4254 1.3575 1.4907 1.5623 2.1860 1.5261 2.1147 1.1438 2.0198 1.1634 1.0852 1.0861 1.0978 1.1053 1.0504 1.0799 1.1006 1.1448 1.0717 1.0533 2.0506 1.0602 1.0760 6.1397 6.1487 1.0707 1.0575 1.0709 1.0616 1.0691 1.0657 1.0665 1.0621 1.0622 1.0859 1.0689 1.0828 1.0847 1.0890 1.0866 1.0718 1.0980 1.0989 1.0719 1.0930 1.0892 1.0970 1.1009 1.1004 1.0865 1.0862 1.0914 1.0954 1.1014
irintensity: 0.0475 0.3298 0.1044 0.2902 0.2294 0.1794 0.4528 3.7709 0.8227 0.1062 0.7023 1.5155 0.1422 0.2428 1.2284 0.3588 0.1227 2.7223 1.9549 10.4897 2.0982 1.2219 1.7692 0.2719 0.2921 5.9455 10.2246 7.8219 0.2226 8.8942 2.1340 0.2188 0.0225 33.9070 3.0012 39.2631 33.9397 2.7788 26.0677 2.3668 3.6207 8.9850 3.4183 1.9771 0.0875 6.2793 5.9970 17.2763 1.3254 1.1566 0.3680 0.0090 0.1865 39.6527 16.3003 34.1828 11.0280 20.2697 9.1276 18.9395 23.3132 18.4824 17.0921 11.2154 1.2454 7.2443 8.7326 12.0021 2.1071 49.6285 1.2732 9.3253 1.6622 7.6920 4.1918 3.3822 3.6219 16.9720 28.9794 6.6895 9.2594 2.0930 2.1768 8.3287 11.7986 3.5022 3.5637 0.6175 5.0675 12.3364 3.7679 0.8080 2.2257 12.5411 1.2223 7.6906 2.9639 2.7252 15.4436 1.3292 3.0674 2.8914 1.3365 16.3894 12.3671 11.0948 28.9200 5.7184 8.7778 15.1885 12.7657 9.8430 9.4287 0.9631 6.6330 46.0206 70.3317 51.4737 108.9405 126.5831 202.4852 75.4916 25.4757 21.1982 20.6879 100.4541 57.6548 69.2442 21.4869 4.4548 46.5270 55.1457 19.1171 42.8985 71.7455 42.7953 58.2108 35.2672 52.3264 7.7733 0.1429 19.5140 36.9304 27.3131
temp: 298.150 k
press: 1.00000 atm
elementType: 7 7 7 6 6 6 6 6 6 6 6 6 6 6 6 6 6 6 6 6 6 1 1 1 1 1 1 1 1 1 1 1 1 1 1 1 1 1 1 1 1 1 1 1 1 1 1 1 1 1
symmnumber: 1
zpe: 1157796.7 jmol-1
zpe.correction: 0.440981 hartree
zpe.thermalcorrener: 0.461704 hartree
zpe.thermalcorrenthalpy: 0.462648 hartree
zpe.thermalcorrgfe: 0.389408 hartree
zpe.sumelectzpe: -865.882181 hartree
zpe.sumelectthermal: -865.861459 hartree
zpe.sumelectthermalent: -865.860515 hartree
zpe.sumelectthermalfe: -865.933755 hartree
dipole: 0.6907 -0.0935 0.7691
dipole: 1.0379
quadrupole: -124.6447 -125.0009 -127.4004
quadrupole: 2.4872 4.5034 0.0785
quadrupole: 1.0373 0.6811 -1.7184 2.4872 4.5034 0.0785
hfenergy: -866.3231628 hartree
pointgroup: C01 [X(C18H29N3)]
dipole: 0.270402 -0.0311241 -0.3044039 debye
polarizability: 253.6982943|-19.4869258|184.036457|-12.2113236|-8.9198679|185.3388443 unknown
InChI: InChI=1S/C18H29N3/c1-19(2)11-12-21-17-9-6-10-18(21)15-20(14-17)13-16-7-4-3-5-8-16/h3-5,7-8,17-18H,6,9-15H2,1-2H3
charge 0 multiplicity 1
50 atoms
N  1.815114 -0.354398 -0.331931
N  -1.043225 -0.561647 -0.712186
N  5.301192 1.083241 0.20425
C  0.890488 0.364726 0.597383
C  1.215712 -1.67603 -0.674945
C  0.668445 -0.419392 1.927747
C  1.032861 -2.57788 0.583359
C  -0.405469 0.672084 -0.186321
C  -0.084047 -1.405319 -1.46934
C  0.209765 -1.885494 1.701426
C  3.242235 -0.37077 0.064322
C  -2.263986 -0.278164 -1.498224
C  3.940614 0.939769 -0.367109
C  -3.422871 0.253652 -0.659079
C  -3.69849 -0.291406 0.620724
C  -4.27572 1.263939 -1.167466
C  5.819145 2.45898 0.060764
C  6.257669 0.085733 -0.317067
C  -4.805179 0.159782 1.372389
C  -5.388126 1.715703 -0.419816
C  -5.657271 1.163974 0.853529
H  1.347908 1.342722 0.844982
H  1.908884 -2.186361 -1.37319
H  -0.069249 0.118177 2.555194
H  1.622643 -0.415326 2.493385
H  2.043552 -2.827858 0.967995
H  0.556361 -3.536681 0.297367
H  -1.1319 1.189795 0.466828
H  -0.135553 1.3686 -1.021124
H  0.214684 -0.914686 -2.430891
H  -0.58083 -2.364469 -1.714946
H  0.305194 -2.456729 2.646262
H  -0.854314 -1.8872 1.411302
H  3.407631 -0.504286 1.158338
H  3.71764 -1.233889 -0.439627
H  -2.572596 -1.23344 -1.971058
H  -2.062643 0.437915 -2.337556
H  3.937834 0.993882 -1.485808
H  3.335621 1.793039 -0.005613
H  -3.027953 -1.062918 1.015667
H  -4.066929 1.700702 -2.152568
H  5.118778 3.17135 0.532527
H  5.964752 2.773229 -1.005134
H  6.793249 2.546242 0.575585
H  5.916915 -0.936288 -0.07891
H  7.240782 0.231216 0.165709
H  6.403008 0.154165 -1.426727
H  -5.005779 -0.270288 2.360655
H  -6.038261 2.498556 -0.827213
H  -6.517084 1.514244 1.435964
