program: Gaussian 09
title: 000032078
version: EM64L-G09RevD.01
frameworkgroup: C1[X(C21H25NO5)]
method: RPBEPBE
basis: SDD
operation: Freq
keyword: #p
keyword: freq=noraman
keyword: PBEPBE/SDD
title: #p freq=noraman PBEPBE/SDD
converged: YES YES NO NO
title: Mulliken charges:
elementType: O O O O O N C C C C C C C C C C C C C C C C C C C C C H H H H H H H H H H H H H H H H H H H H H H H H H
charge: -0.286610 -0.234468 -0.291825 -0.294624 -0.242216 -0.395594 -0.000808 -0.632539 0.533035 -0.701615 0.182234 -0.652075 -0.408597 -0.411111 0.138443 0.391961 -0.228057 -0.235119 -0.547268 -0.506776 0.230112 0.293792 0.056972 -0.245049 -0.537909 -0.532885 -0.500724 0.253970 0.211676 0.214052 0.369699 0.259269 0.206099 0.205367 0.271526 0.263756 0.229597 0.232443 0.222781 0.222761 0.291549 0.269560 0.225899 0.224365 0.221256 0.251185 0.228777 0.232572 0.243353 0.218422 0.254666 0.234720
chargesum: 0.00000
title: Mulliken charges with hydrogens summed into heavy atoms:
elementType: O O O O O N C C C C C C C C C C C C C C C C C C C C C
charge: -0.286610 -0.234468 -0.291825 -0.294624 -0.242216 -0.025895 0.253162 -0.206812 0.533035 -0.030880 0.182234 -0.116792 -0.179000 -0.178668 0.138443 0.391961 -0.005276 -0.012358 -0.255719 -0.237216 0.230112 0.293792 0.056972 -0.019150 0.158897 0.171817 0.207084
polarizability: 3.44924679e+02 2.90256546e+01 2.54146223e+02 1.00322984e+01 -1.29049739e+01 2.02962835e+02
1716.lowfreq: -3.4619 -1.3135 -0.0004 0.0004 0.0005 4.5255 12.2396 15.7629 23.8499
frequency: 10.5299 15.3864 23.8190 29.4735 35.8990 39.6436 56.1599 57.8114 78.9372 87.9156 97.8617 104.8093 109.6658 123.7795 140.7132 155.3161 169.5101 198.3784 201.2990 208.8911 227.4052 229.9872 245.6684 257.7420 291.7022 292.2172 314.3007 340.2451 343.9263 354.7744 368.7882 382.0336 403.3240 405.5377 429.3477 445.8669 488.9704 491.9067 501.7217 529.3548 573.1137 582.9964 596.1728 617.9598 620.1260 663.6290 667.9000 699.8121 704.7396 747.0270 758.0448 766.4785 789.4716 809.9797 839.8336 848.6042 853.5653 868.9307 881.8214 884.4929 896.6506 916.7450 935.4194 947.5247 955.4235 971.8635 974.8242 989.9175 991.8477 992.8015 1027.7262 1051.1736 1059.2119 1091.2862 1097.1647 1103.8486 1106.6976 1110.7732 1112.3477 1144.0601 1146.9159 1154.1318 1157.5130 1164.3019 1171.4697 1189.3708 1194.7449 1211.4003 1218.0465 1222.3506 1243.3772 1270.6912 1284.7110 1288.5435 1317.5406 1332.4727 1333.3104 1352.4968 1379.5948 1384.0547 1389.7453 1408.7731 1422.5225 1426.1028 1441.1619 1443.4129 1445.5099 1454.0059 1461.4497 1466.8108 1467.8827 1469.2505 1469.9455 1471.2393 1473.7101 1482.0191 1484.9039 1491.1094 1518.0135 1550.2545 1582.9919 1592.9940 1594.1994 1615.6851 1618.1793 2959.7987 2969.3622 2978.8851 2981.6827 2990.1932 2993.4014 3007.3336 3042.0402 3043.4906 3048.3720 3060.8054 3075.2647 3097.6605 3104.6688 3112.7479 3115.1758 3128.1307 3130.1097 3130.3897 3136.6856 3142.3970 3161.0069 3169.2796 3180.2806 3335.1931
redmass: 4.4327 5.6276 3.6249 2.3571 4.3338 7.8594 2.9310 4.0480 3.0093 3.1863 3.1503 4.8139 3.8005 3.1682 2.4945 3.6636 3.4432 3.8846 1.7359 3.5359 1.8248 2.0617 2.5084 1.1816 2.0636 2.6471 5.0047 4.2313 2.5039 4.3899 7.0683 4.9523 2.8158 3.4928 5.5333 2.9072 4.1975 4.4987 3.1669 6.8374 4.7439 4.4496 4.2087 6.0456 4.7870 4.2019 4.1300 5.3976 1.7294 3.2041 2.5861 3.5147 1.1202 3.1733 1.6928 2.2158 1.3753 5.7483 3.4886 1.5382 2.1576 1.5940 2.0535 2.8215 8.6165 3.3911 1.3925 5.3645 2.5984 1.7827 2.1779 1.8053 2.1065 6.7885 2.7159 1.6105 1.2391 1.2607 1.2580 1.4500 2.0479 1.8064 1.4974 1.6957 1.0545 1.1312 1.1339 1.6330 2.3894 2.0197 1.7847 2.3066 2.1248 1.4513 1.4570 3.5960 1.3283 1.2886 1.2353 6.6710 3.6912 1.1487 3.1599 1.2842 2.1729 1.1987 1.4694 1.0970 1.0639 1.0555 1.0528 1.0750 1.1253 1.1219 1.0857 1.0503 2.3300 2.4122 2.7541 3.2462 6.7728 6.7167 6.0197 6.0515 6.0628 1.0333 1.0323 1.0416 1.0564 1.0620 1.0319 1.0833 1.0949 1.1007 1.1039 1.1044 1.0997 1.0997 1.1001 1.0870 1.0870 1.1005 1.0908 1.0992 1.1058 1.0958 1.1015 1.0901 1.0901 1.0815
irintensity: 0.1625 0.0760 0.8308 4.7101 2.6744 2.0701 3.0294 1.2693 12.7131 1.6849 5.5092 2.5772 0.5554 6.1768 2.9114 2.5340 5.8569 9.2774 0.2886 3.5834 1.8570 7.6933 13.1616 0.7817 1.0535 2.9792 3.6446 18.5802 3.4516 2.9621 0.5676 6.4190 0.1669 1.2349 5.3093 7.1841 4.7926 3.7427 18.6260 5.3228 2.6703 8.1112 14.0867 8.2228 32.3784 6.0974 3.8345 21.4197 73.7874 20.4651 36.5651 8.4764 94.4949 4.5552 24.1894 17.1360 5.2923 0.6141 10.6237 48.0165 8.5280 2.7888 0.4047 4.0779 49.3490 14.6382 0.6573 0.2619 3.1330 3.3153 5.3311 2.9079 20.7618 298.3973 6.5403 15.7215 11.4989 0.1034 0.3723 11.8039 60.6130 194.6283 66.6679 58.0790 0.0068 0.4564 2.6028 4.0006 0.0580 43.7648 20.6066 4.2262 96.1640 9.2706 8.9867 608.4051 23.8621 4.8813 22.8408 1.8771 109.3642 126.1531 66.6180 2.6439 7.4447 15.0170 68.4815 9.7803 3.6971 28.6686 26.5024 40.5569 95.2704 28.5997 54.8512 12.2810 23.3671 124.6105 659.7622 3.9791 142.8295 32.5611 1.5974 13.3326 206.2023 54.5138 47.3964 9.3727 56.9061 13.3099 84.7684 14.7392 3.5352 18.8215 43.3260 37.6223 54.9912 17.7690 36.3271 8.2870 7.9816 23.3109 12.1211 21.5470 16.5037 46.0169 22.7383 5.6867 2.4640 376.9570
temp: 298.150 k
press: 1.00000 atm
elementType: 8 8 8 8 8 7 6 6 6 6 6 6 6 6 6 6 6 6 6 6 6 6 6 6 6 6 6 1 1 1 1 1 1 1 1 1 1 1 1 1 1 1 1 1 1 1 1 1 1 1 1 1
symmnumber: 1
zpe: 1099941.7 jmol-1
zpe.correction: 0.418946 hartree
zpe.thermalcorrener: 0.447002 hartree
zpe.thermalcorrenthalpy: 0.447946 hartree
zpe.thermalcorrgfe: 0.355762 hartree
zpe.sumelectzpe: -1244.070823 hartree
zpe.sumelectthermal: -1244.042767 hartree
zpe.sumelectthermalent: -1244.041823 hartree
zpe.sumelectthermalfe: -1244.134007 hartree
dipole: 3.3117 2.7225 -1.5305
dipole: 4.5521
quadrupole: -150.1763 -155.2079 -152.5679
quadrupole: -1.8482 -6.6436 -6.2473
quadrupole: 2.4744 -2.5572 0.0829 -1.8482 -6.6436 -6.2473
hfenergy: -1244.489769 hartree
pointgroup: C01 [X(C21H25N1O5)]
dipole: -1.2928089 1.0711001 0.6235469 debye
polarizability: 344.2674948|-30.2178048|254.1725511|9.7742574|13.8763986|203.5936915 unknown
InChI: InChI=1S/C21H25NO5/c1-14(10-15-8-6-5-7-9-15)22-20(24)13-17(23)16-11-18(25-2)21(27-4)19(12-16)26-3/h5-9,11-12,14,22H,10,13H2,1-4H3
charge 0 multiplicity 1
52 atoms
O  2.292589 -3.360769 0.016603
O  -4.768628 -1.930347 -1.217326
O  -4.318372 2.256361 1.064745
O  0.397627 0.291168 1.248355
O  -5.851689 0.288393 -0.333487
N  2.591811 -1.286947 1.041708
C  4.024873 -1.487274 1.335389
C  4.71672 -0.103551 1.499328
C  4.702109 0.746025 0.2367
C  4.217105 -2.372208 2.589461
C  1.841185 -2.231406 0.396772
C  0.366119 -1.884805 0.095442
C  5.634133 0.500171 -0.805137
C  3.748809 1.780998 0.057799
C  -0.276379 -0.596951 0.622022
C  -1.730235 -0.386928 0.375024
C  5.614543 1.263828 -1.993191
C  3.724377 2.548066 -1.129528
C  -2.317914 0.806533 0.863453
C  -2.527941 -1.322953 -0.335887
C  -3.899953 -1.07065 -0.540592
C  -3.683583 1.071467 0.654182
C  -4.508638 0.125426 -0.034549
C  4.657691 2.2925 -2.159955
C  -4.197186 -3.156316 -1.78182
C  -3.492283 3.261509 1.742109
C  -6.76853 0.938665 0.628398
H  4.461648 -2.017089 0.46695
H  5.759279 -0.29814 1.815139
H  4.226476 0.437547 2.333371
H  2.104151 -0.415517 1.308791
H  3.697231 -3.33496 2.450535
H  5.290114 -2.579005 2.75998
H  3.810313 -1.874831 3.489566
H  0.273865 -1.893286 -1.009566
H  -0.226044 -2.754562 0.438418
H  6.382705 -0.29323 -0.682509
H  3.019313 1.98963 0.850731
H  6.344407 1.060597 -2.785295
H  2.979463 3.343173 -1.249127
H  -1.664268 1.508841 1.387531
H  -2.084861 -2.244406 -0.719022
H  4.642129 2.887882 -3.079926
H  -3.412209 -2.92852 -2.52893
H  -3.78147 -3.811406 -0.991235
H  -5.041602 -3.660358 -2.273312
H  -3.07318 2.866462 2.687086
H  -2.671157 3.609204 1.087044
H  -4.176931 4.095017 1.956766
H  -6.646125 0.500737 1.635739
H  -6.593443 2.023833 0.670709
H  -7.771064 0.711483 0.235644
