program: Gaussian 09
title: 000003349
version: EM64L-G09RevD.01
frameworkgroup: C1[X(C12H10FN3O4)]
method: RPBEPBE
basis: SDD
operation: Freq
keyword: #p
keyword: freq=noraman
keyword: PBEPBE/SDD
title: #p freq=noraman PBEPBE/SDD
converged: YES YES NO NO
title: Mulliken charges:
elementType: F O O O O N N N C C C C C C C C C C C C H H H H H H H H H H
charge: -0.202161 -0.315197 -0.203323 -0.214057 -0.255862 -0.440159 -0.402777 -0.607705 0.113770 -0.514306 0.374211 -0.118055 0.176111 0.186299 0.159009 -0.532817 0.162243 -0.341845 0.329513 -0.365572 0.243443 0.282058 0.309073 0.328820 0.355147 0.277506 0.253953 0.263433 0.339411 0.359836
chargesum: 0.00000
title: Mulliken charges with hydrogens summed into heavy atoms:
elementType: F O O O O N N N C C C C C C C C C C C C
charge: -0.202161 -0.315197 -0.203323 -0.214057 -0.255862 -0.111339 -0.047630 0.091542 0.113770 0.011196 0.374211 0.191018 0.176111 0.186299 0.159009 -0.255312 0.162243 -0.087892 0.329513 -0.102139
polarizability: 1.81456630e+02 7.65234255e+00 1.88893416e+02 -5.95021593e+00 -5.00074029e+00 9.93721527e+01
1716.lowfreq: -7.7500 -5.7250 -3.1567 -0.0006 -0.0005 0.0005 40.9504 49.9557 51.8529
frequency: 40.9455 49.9429 51.8277 79.9903 88.3237 130.2654 152.9723 156.6821 205.7346 244.2299 251.4279 266.6362 295.8136 345.1953 363.0544 383.1328 401.6511 429.2961 456.3791 477.4435 495.6136 505.5499 527.4025 549.4111 574.6380 601.6286 603.9792 620.3864 634.3158 652.3028 671.5701 691.4324 705.1685 715.4617 728.4368 755.4696 763.6241 802.5860 820.5865 879.4257 885.5773 922.7234 932.5551 943.0703 966.6329 1033.7355 1059.4336 1069.3968 1088.3323 1116.9274 1134.3020 1143.0264 1180.6780 1190.6062 1221.6288 1240.4347 1256.8707 1279.2677 1306.3946 1316.3955 1320.8579 1343.0494 1365.5531 1373.3826 1388.5847 1417.9725 1454.8685 1473.0523 1572.0964 1593.3262 1623.2010 1646.3397 1677.9832 1726.8142 3000.2679 3014.2132 3094.1033 3162.6886 3165.0324 3186.2023 3511.2042 3583.6302 3600.2186 3669.7996
redmass: 8.7388 6.4146 8.2720 6.7129 6.6893 7.2642 7.7523 8.0908 5.1324 5.3107 6.6744 7.8234 5.4448 7.5437 6.0356 7.8070 3.8166 4.1089 2.7893 4.0669 3.8250 1.5174 3.7485 3.9831 4.2186 4.1701 1.7507 4.4862 1.1342 1.3166 4.3239 3.6946 7.0720 4.3814 5.8508 5.0692 5.5022 3.7543 1.5107 2.5802 2.1003 3.3407 3.5830 1.3438 3.3679 2.8423 2.5879 3.1297 2.9921 1.7811 2.3302 2.0154 2.3639 3.2209 2.4396 2.1604 1.5605 1.5298 3.3856 2.3245 1.3255 1.5080 3.7592 1.7553 7.6216 4.4458 1.1004 2.9450 1.3526 8.2185 7.2003 5.3698 8.6947 9.2604 1.0798 1.0674 1.1002 1.0917 1.0892 1.0977 1.0443 1.0803 1.0802 1.1050
irintensity: 5.0344 2.6061 1.8445 0.7776 0.9478 6.6864 3.7288 1.6014 1.8609 8.0101 3.5183 0.9456 1.3348 5.6564 0.6869 10.9406 13.5208 6.0881 21.4607 18.9218 12.1313 66.1386 7.5286 1.5333 8.9804 82.5879 92.8078 21.7343 100.5944 109.6882 23.3123 18.5047 32.4296 6.0649 42.0861 2.1706 39.4261 7.1374 50.7249 12.7003 12.6913 13.6195 49.5946 0.6573 30.0840 24.5273 33.8624 4.6729 9.0382 16.3336 15.3093 29.6718 107.2278 146.5995 34.8093 15.7028 23.1206 47.7153 214.6543 46.0580 27.8727 20.0754 77.8469 10.9881 15.1560 48.6583 6.4157 245.2228 149.0700 0.2754 7.9784 277.0575 476.8165 484.3877 12.6018 8.8804 3.7981 2.0210 2.0831 2.0114 41.2920 88.7589 45.1566 68.9733
temp: 298.150 k
press: 1.00000 atm
elementType: 9 8 8 8 8 7 7 7 6 6 6 6 6 6 6 6 6 6 6 6 1 1 1 1 1 1 1 1 1 1
symmnumber: 1
zpe: 564771.2 jmol-1
zpe.correction: 0.215110 hartree
zpe.thermalcorrener: 0.231814 hartree
zpe.thermalcorrenthalpy: 0.232758 hartree
zpe.thermalcorrgfe: 0.170246 hartree
zpe.sumelectzpe: -1026.896609 hartree
zpe.sumelectthermal: -1026.879905 hartree
zpe.sumelectthermalent: -1026.878961 hartree
zpe.sumelectthermalfe: -1026.941473 hartree
dipole: -1.4013 -4.1416 -1.4308
dipole: 4.6004
quadrupole: -128.7395 -113.0760 -116.4508
quadrupole: 12.0638 6.0253 6.2529
quadrupole: -9.3174 6.3461 2.9713 12.0638 6.0253 6.2529
hfenergy: -1027.1117194 hartree
pointgroup: C01 [X(C12H10F1N3O4)]
dipole: 0.6790366 1.6442446 -0.3335014 debye
polarizability: 181.3566658|6.3961341|185.5773311|11.9362966|15.1430793|102.7882021 unknown
InChI: InChI=1S/C12H10FN3O4/c13-5-1-2-7-6(3-5)12(4-8(20-7)9(14)17)10(18)15-11(19)16-12/h1-3,8,15-16H,4,14H2
charge 0 multiplicity 1
30 atoms
F  -3.783098 2.388573 0.003217
O  1.67943 1.210662 0.341283
O  0.043663 -1.758321 2.103629
O  -2.358797 -3.681998 -1.468541
O  4.21353 -1.363057 -0.114055
N  -0.989386 -1.736988 -1.315903
N  -1.283685 -2.952565 0.543134
N  4.266438 0.968728 0.042165
C  -0.179731 -1.033236 -0.306692
C  1.334684 -1.043499 -0.660896
C  -0.644605 0.408123 -0.061839
C  2.125241 -0.207757 0.35688
C  -0.438436 -1.927898 0.959924
C  0.291988 1.429391 0.25692
C  -1.630962 -2.877111 -0.84747
C  -2.017357 0.745478 -0.140247
C  3.635772 -0.250812 0.06557
C  -0.134338 2.759074 0.484007
C  -2.413498 2.068119 0.089582
C  -1.498779 3.091257 0.400823
H  1.4715 -0.621542 -1.674786
H  1.73611 -2.070298 -0.661564
H  1.951815 -0.602101 1.377869
H  -1.054877 -1.451323 -2.29149
H  -1.623527 -3.703832 1.144684
H  -2.765578 -0.012544 -0.39164
H  0.614293 3.518002 0.727828
H  -1.851196 4.111667 0.573696
H  5.272056 1.003644 -0.11927
H  3.723528 1.822164 0.17548
