program: Gaussian 09
title: Molecule Name
version: AM64L-G09RevD.01
method: RB3LYP
basis: GenECP
operation: Freq
keyword: #NGeom=AllCheck
keyword: Guess=TCheck
keyword: SCRF=Check
keyword: GenChk
keyword: RB3LYP/GenECP
keyword: Freq
keyword: #N
keyword: Geom=AllCheck
title: Mulliken charges:
elementType: Rh Rh O C O H O C O H O C O H O C O H C C O O C H H H H C C H H H C C C C H C H C H H H N C C H H H H C H H H
charge: 0.372050 0.429711 -0.472843 0.438678 -0.465002 0.169549 -0.472284 0.438356 -0.464158 0.168590 -0.468745 0.436699 -0.468166 0.170889 -0.469871 0.438834 -0.468953 0.170040 -0.438570 0.675706 -0.498887 -0.449952 -0.222357 0.176831 0.173953 0.182944 0.320039 -0.374132 -0.278361 0.244142 0.187785 0.181580 0.171594 -0.176638 -0.172662 -0.153390 0.196285 -0.146743 0.155789 -0.131672 0.152541 0.152303 0.153567 -0.264239 0.242335 -0.511329 0.235957 0.235811 0.235852 0.217967 -0.454718 0.168637 0.164987 0.163672
chargesum: 0.00000
title: Mulliken charges with hydrogens summed into heavy atoms:
elementType: Rh Rh O C O O C O O C O O C O C C O O C C C C C C C C C N C C C
charge: 0.372050 0.429711 -0.472843 0.608227 -0.465002 -0.472284 0.606946 -0.464158 -0.468745 0.607588 -0.468166 -0.469871 0.608874 -0.468953 -0.118532 0.675706 -0.498887 -0.449952 0.311370 0.087977 0.091004 0.171594 0.019646 -0.016873 -0.000848 0.005561 0.021894 -0.264239 0.242335 0.196290 0.042579
dipole: -0.0087 2.9866 0.1440
dipole: 2.9901
quadrupole: -126.2263 -183.8486 -197.6610
quadrupole: -1.8180 1.3657 -4.4172
quadrupole: 43.0190 -14.6033 -28.4157 -1.8180 1.3657 -4.4172
hfenergy: -1725.8851748 hartree
pointgroup: C01 [X(C18H23N1O10Rh2)]
dipole: 0.063965 -0.9795264 0.6483364 debye
polarizability: 550.1691523|4.1370546|382.5828663|3.8842285|12.9552819|380.8380452 unknown
InChI: InChI=1S/C12H16O2.C2H3N.4CHO2.2Rh/c1-3-9-15-11(12(13)14-2)10-7-5-4-6-8-10;1-2-3;4*2-1-3;;/h4-8H,3,9H2,1-2H3;1H3;4*1H;;/q;;4*-2;2*+4
charge 0 multiplicity 1
54 atoms
Rh 0.05301407 0.10666326 0.08831588
Rh 2.50453511 -0.10173242 -0.08976597
O  2.51206071 1.74151293 -1.06035519
C  1.40459767 2.3246921 -1.24209306
O  0.24814076 1.93077749 -0.90726782
H  1.44775849 3.29551779 -1.755922
O  2.19883219 -1.05889229 -1.91899239
C  1.00992396 -1.21573636 -2.32274076
O  -0.06540132 -0.86505899 -1.75172276
H  0.89251074 -1.7213718 -3.29191153
O  2.33235142 -1.93284016 0.89852007
C  1.18509182 -2.31547891 1.26335212
O  0.07476073 -1.72479559 1.09667271
H  1.13865159 -3.27834709 1.79130273
O  2.61238332 0.87293022 1.75820463
C  1.53774155 1.21702675 2.32785737
O  0.34812699 1.0571181 1.91792587
H  1.64303714 1.71875434 3.30024461
C  -2.30490397 0.33955587 0.25734776
C  -2.5340574 1.78217104 -0.00885451
O  -2.48613053 2.68681997 0.81111052
O  -2.72328205 1.99590345 -1.32998949
C  -2.76166753 3.37517244 -1.74092183
H  -2.93510323 3.35090873 -2.81656206
H  -3.57240766 3.90519384 -1.23549357
H  -1.80828804 3.85903048 -1.51860289
H  -2.04488954 0.18214083 1.41960437
C  -2.95809217 0.35115269 2.40172986
C  -2.96355336 -1.00560895 3.05379922
H  -2.37341913 1.13208117 2.88706477
H  -1.93944215 -1.3248741 3.27381243
H  -3.40444621 -1.74510674 2.37594452
C  -3.18786502 -0.69431569 -0.32851668
C  -2.79790137 -2.04997672 -0.30872739
C  -4.44107728 -0.37408428 -0.89497382
C  -3.6216307 -3.04046186 -0.84310597
H  -1.84173313 -2.31663676 0.12545924
C  -5.25367465 -1.36353484 -1.44388929
H  -4.77594085 0.65697308 -0.91608449
C  -4.84852421 -2.70148951 -1.41887159
H  -3.300143 -4.07803579 -0.81659901
H  -6.20961539 -1.09112052 -1.88239302
H  -5.48572129 -3.47272871 -1.84266563
N  4.88066727 -0.29667298 -0.24352064
C  6.03482632 -0.37661619 -0.30571952
C  7.48767016 -0.47622607 -0.38354675
H  7.94489156 0.15487834 0.38396285
H  7.79835927 -1.51298478 -0.2256334
H  7.83075518 -0.14641306 -1.36834988
H  -3.92133764 0.71555735 2.05834433
C  -3.78849151 -0.95313835 4.35714895
H  -3.79097802 -1.94111511 4.82954499
H  -3.36539902 -0.23645103 5.06887805
H  -4.82673916 -0.66707854 4.15784025
