program: Gaussian 09
title: Molecule Name
version: AM64L-G09RevD.01
method: RB3LYP
basis: GenECP
operation: Freq
keyword: #N
keyword: Geom=AllCheck
keyword: Guess=TCheck
keyword: SCRF=Check
keyword: GenChk
keyword: RB3LYP/GenECP
keyword: Freq
title: Mulliken charges:
elementType: Rh Rh O C O H O C O H O C O H O C O H C H C C C H H H H H H H C C C C H C H C H H H C C C C H C H C H H H N C C H H H
charge: 0.480583 0.365246 -0.472070 0.434142 -0.460659 0.165972 -0.468928 0.437242 -0.466044 0.169388 -0.471897 0.434322 -0.461216 0.166039 -0.468837 0.437593 -0.465378 0.169463 -0.116326 0.138152 -0.244910 -0.441241 -0.463764 0.133371 0.141822 0.142084 0.140555 0.165144 0.146161 0.141945 0.063590 -0.137792 -0.154553 -0.152615 0.199391 -0.142621 0.173915 -0.117571 0.162268 0.163174 0.166438 0.064021 -0.138035 -0.155555 -0.152297 0.197763 -0.141388 0.173584 -0.118933 0.162282 0.162934 0.166125 -0.290083 0.254021 -0.512884 0.232317 0.232250 0.232300
chargesum: 0.00000
title: Mulliken charges with hydrogens summed into heavy atoms:
elementType: Rh Rh O C O O C O O C O O C O C C C C C C C C C C C C C C C C N C C
charge: 0.480583 0.365246 -0.472070 0.600113 -0.460659 -0.468928 0.606630 -0.466044 -0.471897 0.600360 -0.461216 -0.468837 0.607056 -0.465378 -0.116326 0.026613 -0.015389 -0.011904 0.063590 0.061599 0.019361 0.009654 0.020553 0.048866 0.064021 0.059728 0.018028 0.009985 0.021546 0.047192 -0.290083 0.254021 0.183983
dipole: -3.1351 0.6410 0.5112
dipole: 3.2406
quadrupole: -140.2722 -189.8916 -207.0343
quadrupole: -11.3448 -13.8215 -7.4265
quadrupole: 38.7938 -10.8255 -27.9683 -11.3448 -13.8215 -7.4265
hfenergy: -1729.1011648 hartree
pointgroup: C01 [X(C22H25N1O8Rh2)]
dipole: -1.2332333 -0.2527627 -0.2017515 debye
polarizability: 651.8451837|36.8977339|506.685287|54.1295419|-89.2230514|384.2506203 unknown
InChI: InChI=1S/C13H10.C3H8.C2H3N.4CHO2.2Rh/c1-3-7-12(8-4-1)11-13-9-5-2-6-10-13;1-3-2;1-2-3;4*2-1-3;;/h1-10H;3H2,1-2H3;1H3;4*1H;;/q;;;4*-2;2*+4
charge 0 multiplicity 1
58 atoms
Rh 0.16416606 -0.26642435 -0.27618542
Rh 2.61270199 0.13581255 0.0672763
O  2.58381579 1.18068784 -1.74696736
C  1.49651118 1.25932321 -2.38209532
O  0.35983715 0.78854228 -2.06625689
H  1.52691074 1.80615891 -3.33592672
O  2.95735673 -1.64362327 -0.97476497
C  1.96493687 -2.28550243 -1.41131892
O  0.73053477 -1.9993062 -1.30340823
H  2.18219139 -3.21410395 -1.95855807
O  2.42729823 -0.94625792 1.85069886
C  1.29100667 -1.38776526 2.17556205
O  0.19202142 -1.28203479 1.54737637
H  1.23464587 -1.93851669 3.12595252
O  2.08674536 1.88645492 1.08334123
C  0.86462554 2.16525655 1.20880109
O  -0.14088386 1.51088164 0.78613798
H  0.62402671 3.08996414 1.75248767
C  -1.87145581 -0.607016 -0.56937967
H  -4.16729297 2.8256599 1.26862679
C  -4.12904306 3.00658577 2.35165065
C  -5.55541255 3.09064821 2.90566178
C  -3.29020174 1.91070433 3.01878558
H  -3.63001967 3.97681737 2.48106155
H  -6.09180409 2.14449483 2.75948529
H  -6.13266184 3.88163541 2.41243951
H  -3.19648421 2.08652177 4.09805168
H  -2.28075276 1.86661245 2.59404052
H  -3.75294605 0.92439227 2.88388179
H  -5.54851514 3.30346735 3.98220651
C  -2.53515308 -1.74995058 0.02092733
C  -1.86211728 -2.98514276 0.21149063
C  -3.87555114 -1.64207576 0.48697809
C  -2.51401639 -4.06445487 0.79496015
H  -0.84540313 -3.08728668 -0.1437191
C  -4.4997878 -2.71041056 1.12133272
H  -4.39925821 -0.69829066 0.38252391
C  -3.82667172 -3.92824477 1.26354366
H  -1.99595457 -5.01296149 0.90231672
H  -5.51295662 -2.5994561 1.4959908
H  -4.32107127 -4.76804415 1.74356122
C  -2.6693816 0.29094391 -1.37788042
C  -2.416897 1.68732898 -1.40519205
C  -3.6990675 -0.21790104 -2.21712295
C  -3.18875426 2.5310984 -2.19484077
H  -1.64039753 2.09091543 -0.76888868
C  -4.42606646 0.62751486 -3.0482738
H  -3.88745531 -1.28577327 -2.23822753
C  -4.18418547 2.00489399 -3.02777147
H  -3.00569882 3.60150032 -2.17825228
H  -5.18812583 0.2166434 -3.70377825
H  -4.76511897 2.66698522 -3.66356832
N  5.13161115 0.55022596 0.42752207
C  6.26307562 0.72841431 0.60866295
C  7.6868107 0.9525052 0.83686113
H  8.12931773 0.07694757 1.32062977
H  8.19458905 1.12755283 -0.11600186
H  7.82846298 1.82491546 1.48130219
