program: Gaussian 09
title: Molecule Name
version: AM64L-G09RevD.01
method: RB3LYP
basis: GenECP
operation: Freq
keyword: #N
keyword: Geom=AllCheck
keyword: Guess=TCheck
keyword: SCRF=Check
keyword: GenChk
keyword: RB3LYP/GenECP
keyword: Freq
title: Mulliken charges:
elementType: Rh Rh O C O H O C O H O C O H O C O H C N N N C C H H H C O O C H H H C O O C H H H
charge: 0.506762 0.514109 -0.474687 0.446525 -0.467344 0.178545 -0.474453 0.446881 -0.467207 0.178361 -0.473795 0.444683 -0.467144 0.178600 -0.474371 0.446834 -0.467329 0.178310 0.000240 0.156882 -0.124169 -0.280531 0.247967 -0.511946 0.241254 0.241259 0.241304 0.631168 -0.463466 -0.470186 -0.229992 0.194052 0.184784 0.180693 0.608285 -0.488179 -0.440472 -0.225171 0.185504 0.181087 0.186350
chargesum: 0.00000
title: Mulliken charges with hydrogens summed into heavy atoms:
elementType: Rh Rh O C O O C O O C O O C O C N N N C C C O O C C O O C
charge: 0.506762 0.514109 -0.474687 0.625070 -0.467344 -0.474453 0.625242 -0.467207 -0.473795 0.623284 -0.467144 -0.474371 0.625144 -0.467329 0.000240 0.156882 -0.124169 -0.280531 0.247967 0.211871 0.631168 -0.463466 -0.470186 0.329537 0.608285 -0.488179 -0.440472 0.327770
dipole: -7.8304 1.6109 -0.6007
dipole: 8.0170
quadrupole: -123.0154 -161.4399 -184.3210
quadrupole: 6.3827 -2.3549 5.5431
quadrupole: 33.2433 -5.1811 -28.0622 6.3827 -2.3549 5.5431
hfenergy: -1713.1188505 hartree
pointgroup: C01 [X(C11H13N3O12Rh2)]
dipole: -3.0804034 0.635118 -0.2370381 debye
polarizability: 315.5524149|-4.1143401|290.8752365|0.685259|11.0696839|314.8929022 unknown
InChI: InChI=1S/C5H6N2O4.C2H3N.4CHO2.2Rh/c1-10-4(8)3(7-6)5(9)11-2;1-2-3;4*2-1-3;;/h1-2H3;1H3;4*1H;;/q;;4*-2;2*+4
charge 0 multiplicity 1
41 atoms
Rh -2.22633346 -0.05402815 -0.00031842
Rh 0.20256586 0.02663697 0.0156182
O  0.17505354 -1.5752983 1.33762409
C  -0.9483535 -2.04449273 1.68405758
O  -2.09967924 -1.65504986 1.32217276
H  -0.92699552 -2.89170269 2.38256669
O  0.0767081 1.3454827 1.61463968
C  -1.07306786 1.66110325 2.03972885
O  -2.19811704 1.26908114 1.60539901
H  -1.10352904 2.35866913 2.88744539
O  0.08460743 1.62482196 -1.30840151
C  -1.06321842 2.018784 -1.6687061
O  -2.19020499 1.55254194 -1.32175246
H  -1.0896393 2.86656179 -2.36622949
O  0.18465117 -1.29605767 -1.58558928
C  -0.93606203 -1.68703414 -2.02525455
O  -2.09019246 -1.37162389 -1.60487638
H  -0.90936382 -2.38394006 -2.87363362
C  3.86016067 0.09465338 0.43399762
N  3.81061836 0.48424967 1.69996498
N  3.77393759 0.8069455 2.78095858
N  -4.44908971 -0.12634471 -0.0133018
C  -5.6058737 -0.16061008 -0.01873127
C  -7.0620916 -0.20302794 -0.02553323
H  -7.45144948 0.3265676 0.84868458
H  -7.44162121 0.27455609 -0.93338523
H  -7.40241581 -1.2420308 0.00289728
C  3.69391775 1.13634005 -0.59780683
O  3.7207357 0.93952934 -1.79633017
O  3.50195962 2.34271835 -0.02577026
C  3.27102455 3.44015943 -0.93415986
H  2.33629025 3.28040585 -1.47587532
H  3.20185334 4.32440737 -0.30180204
H  4.1015729 3.53438877 -1.6368574
C  4.02435064 -1.36273883 0.27687708
O  4.11343701 -2.12045549 1.23029089
O  4.06001891 -1.74163369 -1.00466136
C  4.21488158 -3.15924333 -1.22760909
H  4.24537141 -3.27525641 -2.31012079
H  5.14279962 -3.51649091 -0.77562822
H  3.36714117 -3.7049136 -0.80683458
