program: Gaussian 09
title: Molecule Name
version: AM64L-G09RevD.01
method: RB3LYP
basis: GenECP
operation: Freq
keyword: #N
keyword: Geom=AllCheck
keyword: Guess=TCheck
keyword: SCRF=Check
keyword: GenChk
keyword: RB3LYP/GenECP
keyword: Freq
title: Mulliken charges:
elementType: Rh Rh O C O H O C O H O C O H O C O H C C C C C H C H C H H H N N Cl C H H Cl C O O C H H H
charge: 0.461356 0.440055 -0.458282 0.446352 -0.449163 0.155029 -0.461692 0.445848 -0.448323 0.155399 -0.454190 0.444398 -0.465167 0.150811 -0.441752 0.443666 -0.468332 0.154177 -0.134547 0.161336 -0.161530 -0.171324 -0.140301 0.190255 -0.134116 0.133245 -0.122541 0.132536 0.131171 0.129432 0.204810 -0.093146 0.062228 -0.468818 0.274012 0.275214 -0.012069 0.663299 -0.427170 -0.459363 -0.216710 0.189733 0.169253 0.174922
chargesum: 0.00000
title: Mulliken charges with hydrogens summed into heavy atoms:
elementType: Rh Rh O C O O C O O C O O C O C C C C C C C N N Cl C Cl C O O C
charge: 0.461356 0.440055 -0.458282 0.601381 -0.449163 -0.461692 0.601247 -0.448323 -0.454190 0.595208 -0.465167 -0.441752 0.597843 -0.468332 -0.134547 0.161336 0.028725 -0.038079 -0.007765 -0.002944 0.006891 0.204810 -0.093146 0.062228 0.080408 -0.012069 0.663299 -0.427170 -0.459363 0.317199
dipole: -2.9751 -1.1241 -0.5475
dipole: 3.2272
quadrupole: -221.9842 -188.3370 -203.3439
quadrupole: -3.2337 -9.0072 2.0792
quadrupole: -17.4292 16.2180 1.2112 -3.2337 -9.0072 2.0792
hfenergy: -2543.1931887 hartree
pointgroup: C01 [X(C14H14Cl2N2O10Rh2)]
dipole: -1.2062612 -0.3257584 -0.225559 debye
polarizability: 332.2943982|-22.7965594|276.3833033|-16.7548783|-7.6896182|261.3476328 unknown
InChI: InChI=1S/C9H8N2O2.CH2Cl2.4CHO2.2Rh/c1-13-9(12)8(11-10)7-5-3-2-4-6-7;5*2-1-3;;/h2-6H,1H3;1H2;4*1H;;/q;;4*-2;2*+4
charge 0 multiplicity 1
44 atoms
Rh 1.81724359 -0.12217658 0.45534643
Rh -0.60074415 -0.23653889 0.2031371
O  -0.75352359 1.09828613 1.77787629
C  0.31964709 1.51418952 2.30901679
O  1.50989459 1.21534442 2.00663031
H  0.197431 2.22523589 3.13832
O  -0.59429969 -1.79957264 1.56314501
C  0.52195812 -2.16821576 2.03890673
O  1.66955049 -1.70008747 1.79382859
H  0.48317993 -3.00119652 2.75519506
O  -0.28151183 -1.59736028 -1.3455078
C  0.90996818 -1.88661822 -1.65478137
O  1.98141363 -1.46259438 -1.12959184
H  1.03145484 -2.59751183 -2.48500137
O  -0.43997877 1.33640137 -1.14260599
C  0.70509932 1.81030277 -1.38606683
O  1.82239136 1.44752412 -0.90782527
H  0.73735668 2.64278917 -2.1034143
C  -3.18824741 -0.23401035 -0.01858756
C  -3.58296124 1.20644236 -0.07348902
C  -3.63979759 1.88551862 -1.30238412
C  -3.89697047 1.908429 1.10334702
C  -4.01699635 3.2274337 -1.34111035
H  -3.39180785 1.36135313 -2.21431337
C  -4.27016994 3.24914496 1.05230464
H  -3.84323245 1.41796242 2.07035108
C  -4.33540687 3.91756251 -0.17132889
H  -4.05927544 3.73422604 -2.30156757
H  -4.5108928 3.76947026 1.97535407
H  -4.62886903 4.96286618 -0.21093092
N  -3.37213047 -0.84010138 1.16656264
N  -3.49185186 -1.32400247 2.17923061
Cl 4.65516646 0.02608441 0.56151819
C  4.81437372 0.18352334 -1.23248554
H  4.3716823 -0.70866606 -1.66753334
H  4.27478561 1.0823753 -1.5190265
Cl 6.51282745 0.31828101 -1.75774205
C  -3.27177976 -1.17759616 -1.17438133
O  -3.30895588 -0.84165624 -2.33788433
O  -3.29132847 -2.45943124 -0.75360053
C  -3.23822304 -3.44896295 -1.79591614
H  -2.31160336 -3.33756065 -2.36258928
H  -3.26458752 -4.40914231 -1.28077038
H  -4.09527754 -3.34618827 -2.46595656
