program: Gaussian 09
title: 000031825
version: EM64L-G09RevD.01
frameworkgroup: C1[X(C10H12Cl2N2O3S)]
method: RPBEPBE
basis: SDD
operation: Freq
keyword: #p
keyword: freq=noraman
keyword: PBEPBE/SDD
title: #p freq=noraman PBEPBE/SDD
converged: YES YES NO NO
title: Mulliken charges:
elementType: Cl Cl S O O O N N C C C C C C C C C C H H H H H H H H H H H H
charge: 0.047254 0.016517 0.981990 -0.531196 -0.535805 -0.219160 -0.233505 -0.411951 -0.126611 -0.202587 -0.218723 0.521116 -0.439789 -0.336446 -0.617592 -0.618060 0.350286 -0.729756 0.288727 0.284728 0.241113 0.315010 0.276666 0.251851 0.208291 0.277816 0.210276 0.251560 0.331901 0.366081
chargesum: 0.00000
title: Mulliken charges with hydrogens summed into heavy atoms:
elementType: Cl Cl S O O O N N C C C C C C C C C C
charge: 0.047254 0.016517 0.981990 -0.531196 -0.535805 -0.219160 -0.233505 -0.080051 -0.126611 0.086140 0.066004 0.521116 -0.198676 -0.021436 0.119216 0.121592 0.350286 -0.363675
polarizability: 2.70362338e+02 -3.08285523e+00 1.56313802e+02 -4.88569136e+00 -1.34185696e+01 1.49517816e+02
1716.lowfreq: -16.0094 -5.4815 -1.3924 -0.0026 -0.0002 0.0006 6.9576 24.5903 35.7534
frequency: 5.2809 24.5517 35.5423 45.2759 56.5124 75.5084 79.5358 115.0251 128.0661 164.3038 191.0946 205.0906 220.1004 224.6137 233.7506 241.5063 252.9902 291.4947 299.2839 326.2471 349.2976 389.9886 392.9465 412.5935 413.8257 430.3840 474.3958 521.6838 536.2094 592.6320 618.1200 680.4638 690.9645 707.3113 727.5180 747.7363 807.9823 837.9692 841.4432 857.0652 867.4174 943.0513 955.8166 964.9017 989.5351 995.9029 1015.5273 1050.9941 1078.3021 1108.3121 1121.6940 1173.0728 1184.9951 1185.5133 1187.9003 1207.3696 1224.6431 1263.0585 1299.0260 1381.4044 1403.1918 1405.1081 1416.9875 1453.8306 1462.4288 1469.3525 1474.0563 1476.9807 1524.2357 1596.7276 1600.1877 1623.3375 2915.2558 2919.2692 3040.2378 3042.1617 3097.1056 3098.7340 3128.9726 3157.9410 3162.8047 3165.2256 3196.8166 3482.5942
redmass: 8.3412 7.5592 4.3243 4.0611 4.2801 10.0315 5.2563 10.6570 6.9453 7.1080 5.8258 5.1340 1.0516 3.2252 4.0586 1.9750 10.7822 4.5415 4.8621 5.7062 6.3520 9.4871 3.1814 2.9590 6.3351 10.9286 5.4375 7.4903 3.1459 6.5971 7.1191 4.0286 1.8799 3.3967 3.3156 8.4024 16.0865 1.8829 2.6100 4.3406 1.4587 6.2500 13.5821 1.3921 5.3606 1.3401 1.4343 2.4203 1.2286 1.3710 1.3156 5.1364 1.3600 1.1305 1.5806 1.6733 1.5817 2.0066 1.3809 5.1924 2.4337 1.4138 1.1404 1.0466 1.0506 1.0851 1.8136 1.1751 2.1883 6.1587 4.7811 6.7199 1.0471 1.0464 1.0866 1.0855 1.0983 1.0995 1.0902 1.0911 1.0954 1.0898 1.0951 1.0766
irintensity: 1.7155 1.8509 3.3324 1.4876 1.0859 1.4255 3.1760 2.1061 1.2944 0.7852 2.2461 0.6595 0.1034 6.2854 3.1538 3.3151 11.2137 2.8112 18.8133 4.1341 11.6104 1.3634 3.0326 0.0468 2.1236 42.1342 16.6062 132.2976 108.9589 58.2273 0.6545 12.6178 68.9201 83.5269 10.0493 28.6892 90.5703 37.7644 9.7382 42.8392 41.2442 12.6891 63.1939 2.9716 0.9100 2.8828 0.5758 34.5172 0.0085 22.1595 12.8860 11.8149 16.5082 12.6805 0.7981 16.1483 10.2867 26.2083 13.2616 107.6089 4.7819 41.3045 1.8321 23.9259 7.2665 24.2532 58.5637 22.0520 421.8057 131.0568 17.1998 191.7870 25.7898 87.2343 5.4647 39.8868 1.8221 2.1489 8.9628 1.5147 6.8528 0.4670 5.0852 44.8237
temp: 298.150 k
press: 1.00000 atm
elementType: 17 17 16 8 8 8 7 7 6 6 6 6 6 6 6 6 6 6 1 1 1 1 1 1 1 1 1 1 1 1
symmnumber: 1
zpe: 554817.8 jmol-1
zpe.correction: 0.211319 hartree
zpe.thermalcorrener: 0.231243 hartree
zpe.thermalcorrenthalpy: 0.232188 hartree
zpe.thermalcorrgfe: 0.158447 hartree
zpe.sumelectzpe: -2040.088445 hartree
zpe.sumelectthermal: -2040.068521 hartree
zpe.sumelectthermalent: -2040.067577 hartree
zpe.sumelectthermalfe: -2040.141317 hartree
dipole: 4.1016 2.0348 4.1123
dipole: 6.1542
quadrupole: -153.6587 -129.2098 -128.6848
quadrupole: -21.6719 -13.2692 -1.3246
quadrupole: -16.4743 7.9746 8.4996 -21.6719 -13.2692 -1.3246
hfenergy: -2040.2997642 hartree
pointgroup: C01 [X(C10H12Cl2N2O3S1)]
dipole: 1.5695413 -1.0783442 -1.495408 debye
polarizability: 269.878128|8.579121|150.5504317|-2.776766|-13.9126058|155.7653972 unknown
InChI: InChI=1S/C10H12Cl2N2O3S/c1-14(2)18(16,17)8-5-3-7(4-6-8)13-10(15)9(11)12/h3-6,9,13H,1-2H3
charge 0 multiplicity 1
30 atoms
Cl 5.243784 -1.273943 -1.38546
Cl 5.263362 1.777696 -1.014964
S  -3.560195 0.530802 0.211006
O  -3.873734 0.49008 1.805284
O  -4.109797 1.686537 -0.791794
O  3.331628 -0.524192 1.499729
N  -4.267661 -1.091327 -0.471399
N  2.504973 0.500641 -0.462156
C  -1.674532 0.502736 0.019145
C  -1.113902 1.054286 -1.146527
C  -0.897444 -0.041551 1.055185
C  1.099744 0.479491 -0.254453
C  0.286454 1.039416 -1.279064
C  0.506091 -0.058886 0.920841
C  -4.031958 -1.200727 -1.928404
C  -3.824343 -2.245804 0.342198
C  3.49649 0.016833 0.369424
C  4.926968 0.124107 -0.181759
H  -1.755381 1.510496 -1.907168
H  -1.376907 -0.414313 1.966215
H  0.749619 1.469539 -2.175339
H  1.13809 -0.46917 1.710039
H  -4.280157 -0.236895 -2.40298
H  -4.733533 -1.960971 -2.317172
H  -2.995456 -1.504737 -2.199696
H  -3.938754 -1.994728 1.40968
H  -2.779549 -2.571669 0.136577
H  -4.505189 -3.08639 0.116136
H  2.830222 0.961303 -1.319466
H  5.655265 0.01814 0.629541
