program: Gaussian 09
title: 000031796
version: EM64L-G09RevD.01
frameworkgroup: C1[X(C20H29NO4)]
method: RPBEPBE
basis: SDD
operation: Freq
keyword: #p
keyword: freq=noraman
keyword: PBEPBE/SDD
title: #p freq=noraman PBEPBE/SDD
converged: YES YES NO NO
title: Mulliken charges:
elementType: O O O O N C C C C C C C C C C C C C C C C C C C C H H H H H H H H H H H H H H H H H H H H H H H H H H H H H
charge: -0.226309 -0.288644 -0.246836 -0.245615 -0.090564 0.087153 -0.429785 -0.466943 0.431253 -0.352371 -0.361484 0.193294 0.051480 -0.428230 -0.348406 -0.332326 -0.347894 -0.376603 -0.412134 -0.325589 -0.321468 -0.720137 -0.256449 -0.253278 -0.244604 0.229310 0.224301 0.230260 0.217062 0.213143 0.216627 0.193462 0.219512 0.229426 0.226497 0.200604 0.172567 0.250888 0.188492 0.204516 0.225885 0.188157 0.252502 0.251527 0.213166 0.191222 0.191442 0.211905 0.242401 0.216257 0.223146 0.228636 0.227995 0.231584
chargesum: 0.00000
title: Mulliken charges with hydrogens summed into heavy atoms:
elementType: O O O O N C C C C C C C C C C C C C C C C C C C C
charge: -0.226309 -0.288644 -0.246836 -0.245615 -0.090564 0.087153 0.023825 -0.019621 0.431253 0.077399 0.051489 0.193294 0.280906 -0.001130 0.075049 0.060682 0.066148 -0.124101 -0.160607 0.078799 0.081879 -0.038333 -0.027813 -0.025283 -0.013020
polarizability: 2.43847312e+02 2.31477677e+01 2.33319013e+02 5.49961492e+00 -1.46419316e+00 1.97088069e+02
1716.lowfreq: -17.9449 -8.7285 -5.5449 -0.0003 -0.0003 0.0002 6.4639 14.5891 20.8750
frequency: -10.9120 11.5915 20.5618 39.2177 44.1178 57.1665 77.6045 88.5681 101.9823 118.6197 132.1133 139.6488 168.9508 194.7360 202.3287 211.2760 229.6381 236.9154 259.1893 276.9019 289.7839 303.7153 310.9326 342.4324 369.3765 390.3263 393.0614 403.4138 411.0726 439.4247 464.5842 477.8031 481.9411 494.7356 509.0690 531.7527 561.0126 602.3732 616.9440 631.9979 695.3701 707.1518 748.0195 756.1394 765.9204 781.1813 798.1430 804.2105 810.2934 814.8805 840.8681 856.0462 883.3180 894.8566 906.4046 917.2955 923.8563 935.8893 969.7226 980.1909 990.2367 992.8798 997.8349 1009.6848 1021.7266 1027.1673 1030.9502 1036.3187 1041.1711 1051.6999 1064.7548 1074.4130 1082.0683 1089.8657 1097.7957 1105.5146 1124.0552 1136.7948 1144.1886 1151.0448 1157.6446 1159.2035 1173.7969 1186.7460 1191.2252 1191.5802 1199.1074 1216.3123 1245.8672 1249.0801 1267.7486 1268.6642 1278.1979 1286.3375 1292.0507 1302.7032 1317.6138 1322.1567 1325.7711 1332.2879 1341.8366 1342.9261 1346.0415 1350.4800 1367.1556 1371.2239 1372.3397 1378.3730 1385.7743 1396.8561 1432.5568 1435.0529 1443.8524 1444.8950 1449.7186 1452.3821 1453.5690 1457.2899 1462.4699 1464.9118 1467.3679 1475.2950 1481.5844 1483.1839 1588.4871 1604.2470 1613.0926 2829.9824 2851.5668 2866.9403 2930.2519 2952.2301 2956.3560 2961.9263 2987.5950 2992.0043 3000.5927 3008.9472 3015.8108 3026.0393 3033.1015 3035.7538 3060.7483 3071.8398 3074.8474 3076.2026 3078.0774 3081.2817 3081.4021 3086.4862 3097.3150 3121.9494 3128.8418 3141.8297 3155.5456 3166.6075
redmass: 3.0655 5.0855 5.2415 5.7750 3.8842 3.8658 5.0921 4.7658 3.5859 3.5545 3.4468 3.4795 2.9433 2.0396 2.2913 1.7311 3.1764 1.8467 3.9421 5.5790 2.8085 2.4392 2.4679 4.0380 2.8743 1.8880 2.4064 2.8818 3.8304 3.0394 2.8831 3.0748 4.0263 4.0569 4.1160 3.4845 2.0542 1.9045 6.2767 4.9966 6.2381 1.7608 2.0353 3.0871 3.0727 2.7180 3.6156 2.1834 2.8977 1.6676 1.5930 1.2519 3.3901 2.4419 2.1763 1.7411 2.6930 1.8305 1.5003 1.3982 5.9204 2.8929 1.3129 2.1945 1.7782 2.2118 2.4267 2.7333 2.2761 2.2852 2.2367 4.4892 1.7806 3.2015 2.2284 3.2637 2.2591 2.3787 2.3180 2.6903 2.6079 1.9913 1.0518 1.3616 3.3043 1.0704 1.1591 1.3167 1.3380 1.3282 1.3009 1.2865 1.2525 1.4328 1.1634 1.3633 1.3366 1.3383 1.3717 1.2691 1.2726 1.2859 1.3362 1.4541 1.4455 1.2734 1.3210 5.3560 1.2430 1.4286 1.5022 1.4326 1.0821 1.0811 1.0967 1.0845 1.0979 1.0941 1.0794 1.0562 1.0908 1.0472 1.0968 2.1161 5.9679 7.7264 7.6450 1.0711 1.0707 1.0690 1.0693 1.0665 1.0665 1.0675 1.0424 1.0541 1.0605 1.0604 1.0861 1.0895 1.0863 1.0886 1.1008 1.0980 1.0976 1.0983 1.0961 1.1002 1.0982 1.0986 1.1009 1.0848 1.0880 1.0932 1.0955 1.0995
irintensity: 0.1065 0.5350 0.2412 0.3531 0.0969 0.2608 0.0926 0.2194 0.5502 1.0131 2.2574 0.1324 5.9947 3.8126 1.1185 0.5535 6.2829 0.9908 3.3862 0.0503 3.9971 4.8754 9.1222 8.4874 1.8380 0.0527 1.1726 0.2353 5.9697 2.9677 1.4679 6.0619 1.8330 3.3509 14.1260 14.3986 1.8646 10.8990 0.1399 9.1024 2.9784 60.5355 2.1453 16.1961 8.4259 25.0914 9.7534 35.1371 15.5414 2.6924 0.7010 0.4111 14.6770 4.5150 2.6118 13.3418 7.9218 3.0034 3.2273 0.1223 1.0257 17.8108 0.1546 7.7674 42.7230 11.4053 16.2241 71.7962 18.5339 38.1980 71.8483 18.7705 20.0882 16.4637 26.5029 224.0693 15.8613 26.1275 70.9508 5.9284 5.7114 46.4895 0.1339 9.3029 3.1520 1.0636 1.8847 8.4970 19.3422 20.8084 3.7306 12.9263 0.9080 11.0432 4.6295 18.6492 1.6098 9.2869 1.1511 5.4134 4.8083 7.6679 6.5238 11.1372 4.1054 3.9850 0.9974 0.2364 23.7766 4.5236 16.8251 3.7926 2.4392 3.4591 17.8071 2.5599 13.5762 4.1244 5.6475 5.9830 14.8505 11.7956 7.8943 23.4251 4.0148 94.1934 56.3519 50.2993 58.7556 121.7537 65.1031 32.8780 99.9150 49.8649 5.5025 35.1333 15.4097 22.1893 4.8424 27.8433 17.3018 38.9836 26.9364 34.8360 32.6892 5.9134 41.6830 60.6586 18.9591 36.4282 20.9124 1.6144 2.3603 18.7303 28.9133 13.0923
temp: 298.150 k
press: 1.00000 atm
elementType: 8 8 8 8 7 6 6 6 6 6 6 6 6 6 6 6 6 6 6 6 6 6 6 6 6 1 1 1 1 1 1 1 1 1 1 1 1 1 1 1 1 1 1 1 1 1 1 1 1 1 1 1 1 1
symmnumber: 1
zpe: 1204615.2 jmol-1
zpe.correction: 0.458814 hartree
zpe.thermalcorrener: 0.482467 hartree
zpe.thermalcorrenthalpy: 0.483411 hartree
zpe.thermalcorrgfe: 0.403989 hartree
zpe.sumelectzpe: -1133.211154 hartree
zpe.sumelectthermal: -1133.187500 hartree
zpe.sumelectthermalent: -1133.186556 hartree
zpe.sumelectthermalfe: -1133.265978 hartree
dipole: 1.0940 -0.4697 0.1934
dipole: 1.2062
quadrupole: -183.4219 -137.2620 -148.6245
quadrupole: -7.1101 1.5035 -0.3092
quadrupole: -26.9858 19.1741 7.8117 -7.1101 1.5035 -0.3092
hfenergy: -1133.6699673 hartree
pointgroup: C01 [X(C20H29N1O4)]
dipole: 0.4474959 0.1478414 -0.0556507 debye
polarizability: 239.6479209|-23.3036511|237.7500512|-6.3390455|1.4572025|196.856422 unknown
InChI: InChI=1S/C20H29NO4/c1-17(7-10-21-11-15-24-16-12-21)25-19(22)20(8-13-23-14-9-20)18-5-3-2-4-6-18/h2-6,17H,7-16H2,1H3
charge 0 multiplicity 1
54 atoms
O  -4.931762 1.301393 -1.150748
O  -0.65825 1.525034 0.00239
O  6.070742 -0.835728 -0.258662
O  -1.999692 1.232539 1.882937
N  3.401192 0.312941 -0.087258
C  -2.468767 -0.084476 -0.185971
C  -3.887307 -0.34494 0.413283
C  -2.648206 0.433247 -1.641284
C  -1.60366 -1.369823 -0.096735
C  -4.812993 0.877044 0.255412
C  -3.607507 1.63682 -1.694845
C  -1.729954 0.963151 0.68754
C  0.272373 2.436771 0.76936
C  1.679135 2.128925 0.23528
C  2.116817 0.684203 0.55189
C  4.577558 1.002406 0.50217
C  3.616681 -1.158876 -0.074994
C  -1.377023 -1.965915 1.173764
C  -1.018999 -1.974176 -1.2375
C  5.852982 0.619854 -0.267563
C  4.898803 -1.510079 -0.844584
C  -0.184966 3.883104 0.551143
C  -0.596599 -3.134508 1.298215
C  -0.239827 -3.148263 -1.1152
C  -0.025063 -3.734808 0.151795
H  -4.325428 -1.211047 -0.117082
H  -3.812172 -0.599936 1.484969
H  -1.67464 0.717826 -2.077785
H  -3.083083 -0.381564 -2.250781
H  -4.440618 1.722839 0.872042
H  -5.841518 0.633094 0.568352
H  -3.179207 2.501958 -1.139305
H  -3.793405 1.945831 -2.736817
H  0.178143 2.161964 1.837775
H  1.703842 2.280544 -0.859933
H  2.373533 2.863618 0.68779
H  2.151978 0.542565 1.664865
H  1.342239 -0.001987 0.162873
H  4.705759 0.735072 1.582953
H  4.437528 2.097095 0.436531
H  2.748222 -1.651259 -0.552361
H  3.701632 -1.552837 0.969825
H  -1.802036 -1.50528 2.073498
H  -1.16252 -1.535284 -2.229101
H  6.748845 1.054303 0.206486
H  5.772038 0.979647 -1.316247
H  4.78839 -1.20882 -1.908838
H  5.119012 -2.588845 -0.78391
H  -1.209122 4.032079 0.933816
H  0.48522 4.576745 1.091273
H  -0.162555 4.144514 -0.521597
H  -0.433917 -3.575806 2.287973
H  0.196684 -3.603655 -2.011581
H  0.577249 -4.645314 0.245879
