program: Gaussian 16
title: CAAC2_styrene_metatheis_TS_D_NEW_SP_M06L_GD3, SP CHLOROFORM
version: ES64L-G16RevC.01
method: RM06L
basis: GenECP
operation: SP
keyword: #P
keyword: #
keyword: M06L/GENECP
keyword: 5D
keyword: 7F
keyword: GEOM=CHECK
keyword: GUESS=READ
keyword: GFINPUT
keyword: NOSYMM
keyword: INT=ULTRAFINE
keyword: EMPIRICALDISPERSION=GD3
keyword: SCRF=(PCM,SOLVENT=CHLOROFORM,READ)
keyword: SCF=(VSHIFT=800,NOVARACC,MAXCYCLE=180,CONVER=5)
keyword: SP
title: #P # M06L/GENECP 5D 7F # GEOM=CHECK # GUESS=READ # GFINPUT # NOSYMM #
basis: NPDir=0 NMtPBC= 1 NCelOv= 1 NCel= 1 NClECP= 1 NCelD= 1
basis: NCelK= 1 NCelE2= 1 NClLst= 1 CellRange= 0.0.
basis: One-electron integrals computed using PRISM.
basis: 1 Symmetry operations used in ECPInt.
basis: ECPInt: NShTT= 591328 NPrTT= 1827748 LenC2= 417900 LenP2D= 851803.
basis: LDataN: DoStor=T MaxTD1=10 Len= 848
basis: Number of processors reduced to 35 by ecpmxn.
basis: NBasis= 3727 RedAO= T EigKep= 1.24D-06 NBF= 3727
basis: NBsUse= 3727 1.00D-06 EigRej= -1.00D+00 NBFU= 3727
hfenergy: -2544.3035638 hartree
pointgroup: C01 [X(C38H43Cl2N1Ru1)]
dipole: -1.0630341 1.2929341 -0.1360825 debye
InChI: InChI=1S/C23H29N.C14H12.CH2.2ClH.Ru/c1-6-18-12-11-13-19(7-2)21(18)24-17-23(5,16-22(24,3)4)20-14-9-8-10-15-20;1-3-7-13(8-4-1)11-12-14-9-5-2-6-10-14;;;;/h8-15H,6-7,16H2,1-5H3;1-12H;1H2;2*1H;/q;;;;;+2/p-2
charge 0 multiplicity 1
85 atoms
Ru 0.48988571 -0.83890745 0.4474061
Cl -1.19843236 -2.54404947 0.7867804
Cl 2.28428084 0.7422041 0.07705226
N  -1.40666546 1.42113465 -0.11358547
C  -0.77150597 0.65592189 0.78649302
C  -1.20068294 1.09849765 2.21493489
C  -1.92122968 2.45308523 1.95273708
H  -1.22470067 3.30655404 2.14112809
H  -2.79903137 2.58064314 2.63615929
C  -2.35262133 2.47159741 0.47386071
C  -2.20318967 0.05916801 2.75898435
H  -3.0596831 -0.06437002 2.0692132
H  -2.60014299 0.40751886 3.73507146
H  -1.74466271 -0.93880906 2.88180945
C  -3.81858288 2.06570235 0.25821351
H  -4.0642587 2.01733335 -0.82169385
H  -4.46815043 2.84170028 0.71366529
H  -4.07111625 1.09487938 0.72388719
C  -2.14589578 3.85386805 -0.15169503
H  -1.12442165 4.23914068 0.02173516
H  -2.86028241 4.55759268 0.32426164
H  -2.35596973 3.85066351 -1.2409779
C  -1.33730948 1.19058648 -1.55239214
C  -2.17955615 0.20349025 -2.13910677
C  -2.11983172 0.02835648 -3.53667918
H  -2.75196738 -0.74595296 -3.99981722
C  -1.27293317 0.79948112 -4.33378885
H  -1.24913782 0.6499241 -5.42599495
C  -0.44479541 1.75762087 -3.73912146
H  0.23071992 2.35502863 -4.37045072
C  -0.44759359 1.97502045 -2.34733509
C  -3.10909167 -0.70772082 -1.36229726
H  -3.06091975 -0.48827646 -0.28147475
H  -2.71250544 -1.74361283 -1.4553767
C  0.48839844 3.02438773 -1.77352838
H  -0.0034226 4.02045283 -1.85612015
C  1.85967855 3.10461975 -2.45369576
H  2.37226438 2.12232423 -2.43683671
H  2.50453868 3.82865057 -1.91339322
H  1.79433629 3.45251074 -3.50573265
C  1.24869948 -1.32056124 2.05347776
H  0.77988421 -2.08409836 2.71449081
H  2.18281272 -0.84490303 2.42163762
C  2.0553556 -2.73940847 0.44124781
H  1.3993748 -3.60038525 0.79840462
C  1.7463334 -2.17252512 -0.83123416
H  2.52123531 -1.46554185 -1.27703358
C  0.89954147 -2.81715643 -1.86556543
C  -0.55611393 -3.99445925 -3.99589837
C  0.37141178 -4.12504191 -1.74663742
C  0.68373192 -2.11746939 -3.07694255
C  -0.04068793 -2.69601854 -4.12827986
C  -0.34629739 -4.70354847 -2.79952309
H  0.53991275 -4.70106582 -0.82500577
H  1.09678096 -1.10061578 -3.18877126
H  -0.19277346 -2.13058703 -5.06166329
H  -0.73845034 -5.72831828 -2.69108833
H  -1.11403699 -4.45955878 -4.82518336
C  3.41419016 -2.73680919 1.0476307
C  5.99150298 -2.9400433 2.20952152
C  3.6541903 -3.60032111 2.14247508
C  4.49247977 -1.97158467 0.54875169
C  5.76513827 -2.07427311 1.12662985
C  4.92780428 -3.70377507 2.71656564
H  2.82201641 -4.20562069 2.54054985
H  4.33246299 -1.28501126 -0.29459802
H  6.59432514 -1.47128519 0.72106025
H  5.09198724 -4.38957727 3.56401063
H  6.99624074 -3.02068873 2.65576388
H  0.63485588 2.82932201 -0.69366075
C  -4.5656901 -0.68717948 -1.84658016
H  -5.02022252 0.3218987 -1.76308447
H  -5.17996242 -1.3865349 -1.24132582
H  -4.6569407 -1.00519273 -2.90603793
C  -0.0054498 1.28314685 3.15999242
C  2.20372718 1.70759488 4.8977588
C  0.1314733 0.5480052 4.35573237
C  0.99665205 2.22865109 2.8500763
C  2.08534322 2.44019614 3.70494482
C  1.22307734 0.75917775 5.2171543
H  -0.62242428 -0.20173495 4.63686287
H  0.93367475 2.80416736 1.91385517
H  2.85521981 3.18050931 3.43192257
H  1.29959478 0.17395527 6.14843514
H  3.05905128 1.87571459 5.5725193
