program: Gaussian 16
title: CAAC2_styrene_metathesis_MCB_formation_B_NEW_SP_M06L_GD3, SP CHLOROFORM
version: ES64L-G16RevC.01
method: RM06L
basis: GenECP
operation: SP
keyword: #P
keyword: #
keyword: M06L/GENECP
keyword: 5D
keyword: 7F
keyword: GEOM=CHECK
keyword: GUESS=READ
keyword: GFINPUT
keyword: NOSYMM
keyword: INT=ULTRAFINE
keyword: EMPIRICALDISPERSION=GD3
keyword: SCRF=(PCM,SOLVENT=CHLOROFORM,READ)
keyword: SCF=(VSHIFT=800,NOVARACC,MAXCYCLE=180,CONVER=5)
keyword: SP
title: #P # M06L/GENECP 5D 7F # GEOM=CHECK # GUESS=READ # GFINPUT # NOSYMM #
title: CAAC2_styrene_metathesis_MCB_formation_B_NEW_SP_M06L_GD3, SP CHLOROFOR
basis: NPDir=0 NMtPBC= 1 NCelOv= 1 NCel= 1 NClECP= 1 NCelD= 1
basis: NCelK= 1 NCelE2= 1 NClLst= 1 CellRange= 0.0.
basis: One-electron integrals computed using PRISM.
basis: 1 Symmetry operations used in ECPInt.
basis: ECPInt: NShTT= 591328 NPrTT= 1827748 LenC2= 412110 LenP2D= 840554.
basis: LDataN: DoStor=T MaxTD1=10 Len= 848
basis: Number of processors reduced to 35 by ecpmxn.
basis: NBasis= 3727 RedAO= T EigKep= 1.36D-06 NBF= 3727
basis: NBsUse= 3727 1.00D-06 EigRej= -1.00D+00 NBFU= 3727
hfenergy: -2544.3020773 hartree
pointgroup: C01 [X(C38H43Cl2N1Ru1)]
dipole: -0.9848024 1.176756 -0.3536275 debye
InChI: InChI=1S/C23H29N.C8H8.C7H6.2ClH.Ru/c1-6-18-12-11-13-19(7-2)21(18)24-17-23(5,16-22(24,3)4)20-14-9-8-10-15-20;1-2-8-6-4-3-5-7-8;1-7-5-3-2-4-6-7;;;/h8-15H,6-7,16H2,1-5H3;2-7H,1H2;1-6H;2*1H;/q;;;;;+2/p-2
charge 0 multiplicity 1
85 atoms
Ru 0.6862922 -0.63858729 0.21886743
Cl -1.02392362 -2.23738789 0.80486623
Cl 2.5184231 0.95584751 0.03447012
N  -1.02662297 1.64651865 1.05510438
C  -0.54690359 0.91978164 0.03737673
C  -0.93486127 1.61506822 -1.29892634
C  -1.12842024 3.06918501 -0.79783164
H  -1.78677364 3.68387201 -1.45948537
H  -0.12038492 3.56119385 -0.76098539
C  -1.68545627 2.96423956 0.63006768
C  0.15394599 1.54393908 -2.38691813
H  1.13213859 1.88677369 -1.99902185
H  -0.1497413 2.18788871 -3.23863652
H  0.26900668 0.51118578 -2.77182257
C  -1.24405849 4.13327366 1.51044434
H  -1.50943051 3.96919487 2.57508188
H  -1.7798481 5.04417272 1.1706828
H  -0.15918401 4.33138608 1.43248423
C  -3.21768048 2.86205706 0.67597968
H  -3.60578489 2.00420586 0.09738258
H  -3.64424386 3.79110562 0.24396044
H  -3.57788137 2.78730479 1.72139231
C  -0.95545018 1.206494 2.44616157
C  0.16037703 1.58111212 3.24561244
C  0.21855733 1.09713562 4.57019992
H  1.08910281 1.36206015 5.19228305
C  -0.79382017 0.29655467 5.09912594
H  -0.7273645 -0.07040687 6.13669761
C  -1.89194728 -0.04771307 4.30216203
H  -2.6830348 -0.68476843 4.72448439
C  -2.00466263 0.38920908 2.96929035
C  1.30605629 2.45400981 2.7728574
H  1.15972338 2.74968316 1.71844641
H  2.22886096 1.83230355 2.7632828
C  -3.2254488 -0.01478608 2.16178743
H  -3.96856043 0.81235895 2.20966796
C  -3.91858255 -1.30478477 2.60939558
H  -3.20766647 -2.15448995 2.64895529
H  -4.72112785 -1.56598801 1.88876869
H  -4.39927927 -1.2056975 3.60529373
C  2.21161365 -2.48027418 0.31278129
C  1.9213643 -1.72461155 1.52118498
H  2.72364889 -1.09576091 1.94869144
H  1.23951167 -2.20286305 2.24776674
C  1.42926714 -1.46453875 -1.3282218
H  -2.94062887 -0.10453042 1.09637663
C  1.55293274 3.68951586 3.65173554
H  0.66559277 4.35472197 3.69316625
H  2.40300078 4.28083267 3.25105929
H  1.80811921 3.41286395 4.69584252
C  -2.21947229 1.01490476 -1.91426533
C  -4.47915475 -0.08890411 -3.23644591
C  -2.98919925 1.78891969 -2.81104595
C  -2.59511238 -0.32654809 -1.70627389
C  -3.71621169 -0.86970556 -2.356832
C  -4.10521464 1.2453852 -3.46416792
H  -2.71248043 2.83504424 -3.01764295
H  -2.01390271 -0.95687467 -1.01902124
H  -3.99077115 -1.9209967 -2.16794586
H  -4.68662644 1.87305349 -4.15985436
H  -5.35785375 -0.51658487 -3.74649143
H  1.56084721 -3.40706414 0.16146513
H  2.35983186 -0.95703426 -1.67275375
C  0.94768577 -2.42162346 -2.343092
C  0.25333449 -4.22031213 -4.42416628
C  1.79052075 -2.59948924 -3.47337471
C  -0.25887533 -3.16289655 -2.28765605
C  -0.59450847 -4.05227682 -3.31526307
C  1.44922023 -3.48909261 -4.50050168
H  2.73057869 -2.02597542 -3.53297425
H  -0.91877707 -3.04066214 -1.41848056
H  -1.53674812 -4.62161598 -3.25353142
H  2.12100474 -3.61026482 -5.36620263
H  -0.02095448 -4.92033055 -5.23076795
C  3.60110383 -2.64287292 -0.21230304
C  6.21012011 -3.12924179 -1.20269708
C  4.66215657 -1.76127997 0.09346588
C  3.871001 -3.76630233 -1.02652017
C  5.16392722 -4.01192674 -1.51183119
C  5.9519419 -2.00604198 -0.39888486
H  4.4738632 -0.87230112 0.712375
H  3.05317211 -4.46545451 -1.26677894
H  5.35370468 -4.9011346 -2.13534558
H  6.76852293 -1.30862793 -0.14861496
H  7.22780747 -3.31841053 -1.58196148
