program: Gaussian 09
title: 000031883
version: EM64L-G09RevD.01
frameworkgroup: C1[X(C23H32N2O3)]
method: RPBEPBE
basis: SDD
operation: Freq
keyword: #p
keyword: freq=noraman
keyword: PBEPBE/SDD
title: #p freq=noraman PBEPBE/SDD
converged: YES YES NO NO
title: Mulliken charges:
elementType: O O O N N C C C C C C C C C C C C C C C C C C C C C C C H H H H H H H H H H H H H H H H H H H H H H H H H H H H H H H H
charge: -0.293384 -0.264564 -0.283498 -0.091332 -0.358260 -0.379451 -0.385585 -0.310697 -0.249644 -0.685098 -0.697423 0.428882 -0.381898 -0.291214 0.259129 -0.342541 0.348636 -0.461914 0.358680 -0.383941 -0.398291 -0.188615 -0.685964 -0.350376 -0.354057 -0.239505 -0.224803 -0.253216 0.224131 0.202574 0.221080 0.216457 0.206847 0.184895 0.235728 0.227312 0.225128 0.219544 0.216665 0.231194 0.214252 0.212200 0.210293 0.211077 0.204432 0.206279 0.195611 0.193896 0.272957 0.256562 0.253322 0.229511 0.212678 0.218864 0.212075 0.260426 0.308505 0.223772 0.224826 0.226849
chargesum: 0.00000
title: Mulliken charges with hydrogens summed into heavy atoms:
elementType: O O O N N C C C C C C C C C C C C C C C C C C C C C C C
charge: -0.293384 -0.264564 -0.283498 -0.091332 -0.358260 0.047253 0.051953 0.081044 0.213397 -0.023762 -0.039777 0.428882 0.039472 0.119497 0.259129 0.046967 0.348636 -0.188957 0.358680 -0.127379 -0.144969 0.040897 -0.042347 -0.089950 -0.045551 -0.015733 0.000023 -0.026368
polarizability: 2.98166290e+02 -1.64856901e+01 2.92882679e+02 -3.52461047e+00 2.63143210e+01 2.52450249e+02
1716.lowfreq: -5.6569 -0.0006 -0.0005 0.0006 1.7692 3.4228 3.8366 12.6526 22.7078
frequency: -0.1288 12.4721 22.5921 28.4842 30.2894 42.9257 46.9552 48.9659 56.0068 58.7897 70.9114 83.3172 93.5390 97.5203 106.6680 137.8392 143.0305 166.0566 168.9708 179.1530 202.6108 223.3265 223.8499 234.1321 239.5085 267.5382 270.4185 274.2182 285.7484 301.6746 329.2942 357.2925 372.3502 400.1733 408.3753 413.0738 441.2845 461.2100 489.9121 491.9055 516.2920 533.6177 575.9228 583.2323 615.9729 645.2854 660.0702 690.3466 695.3025 696.0491 725.1709 742.3067 754.6541 763.4011 772.5267 789.8490 794.8207 805.5503 811.9010 824.6805 843.4616 865.1845 877.6272 896.3653 899.2157 903.7396 917.6883 940.2105 957.4535 973.5881 974.1226 976.4125 981.0582 984.3514 990.0419 994.3414 1017.2604 1035.0051 1040.4013 1041.2929 1064.2175 1067.4449 1079.0275 1084.7349 1085.7800 1091.8823 1095.3744 1116.4195 1123.5286 1144.9341 1149.9673 1161.9225 1168.4138 1173.2092 1195.7912 1202.1236 1205.0147 1213.1612 1232.1753 1265.8902 1271.4564 1275.1528 1279.8828 1283.0426 1286.9281 1287.8257 1291.9585 1321.3803 1330.2722 1335.9947 1341.7282 1347.1919 1368.6264 1375.4253 1376.8411 1380.1947 1386.1928 1387.5959 1388.0443 1391.0371 1430.3828 1445.7322 1457.9308 1468.1681 1468.6318 1469.3317 1471.9316 1475.3718 1475.8036 1476.4341 1479.5334 1481.8310 1482.3584 1484.8099 1489.1700 1492.1338 1497.1120 1586.5510 1592.7263 1608.7893 1609.9929 1627.6821 2858.2773 2911.3264 2945.7439 2967.6292 2976.1768 2977.0453 2984.0936 2992.6611 2994.6346 3003.4800 3011.7483 3015.7915 3019.8313 3039.7791 3045.6084 3058.9952 3072.5938 3074.9787 3076.7702 3077.4386 3080.8083 3090.1698 3092.2676 3126.8490 3137.2307 3140.1626 3159.2109 3162.9087 3169.6661 3174.7777 3175.2622 3203.0579
redmass: 4.2432 3.6109 3.8337 4.2794 3.6539 3.3451 2.3733 2.9189 4.5312 2.8988 3.1864 3.9434 3.8854 3.3273 3.1492 2.6122 2.0018 1.8445 3.5844 3.5584 3.2778 1.1343 1.1223 4.3313 4.8223 2.3378 2.7936 4.3158 1.9181 4.8762 4.3165 5.9425 4.0719 2.9366 2.9437 3.5722 4.0906 3.1660 2.7573 3.9336 3.0983 3.8486 6.4486 5.6804 6.3574 6.1072 6.0380 10.6478 2.0829 2.2068 4.4904 1.0773 3.2077 1.6744 1.1452 1.1839 1.4872 1.1982 1.2035 4.4994 1.2548 1.9348 3.6040 1.7561 1.6202 1.8844 1.4164 1.1536 6.7980 1.5028 2.0800 1.3709 5.1042 5.7241 6.6629 1.3157 3.4825 2.1773 2.6820 3.0292 1.9535 1.8154 1.5684 2.1916 2.1445 2.8732 1.5746 1.6605 2.5357 1.4457 2.1406 1.3521 1.2175 1.0570 1.7593 1.6480 2.0850 1.3706 1.7678 2.7148 1.1166 1.4741 1.2023 2.1438 1.0739 1.4616 1.4180 1.4385 1.3592 1.4391 1.2535 1.4663 1.3657 1.7614 1.2418 8.5853 1.3411 1.3564 2.1154 1.7255 3.1217 2.4965 1.0622 1.0553 1.1676 1.0617 1.1958 1.0514 1.0428 1.4349 1.0799 1.2279 1.6810 1.2192 1.0794 1.1428 1.0760 6.3223 6.7706 6.9708 6.1652 9.9321 1.0716 1.0695 1.0551 1.0590 1.0363 1.0350 1.0366 1.0608 1.0592 1.1056 1.1014 1.0816 1.0622 1.0987 1.0935 1.1043 1.0989 1.1015 1.0994 1.0995 1.1008 1.1005 1.1087 1.0850 1.0907 1.0871 1.0965 1.0928 1.0922 1.0970 1.0974 1.0938
irintensity: 0.0506 0.2345 0.0646 0.1071 0.0239 0.2646 0.0071 0.4171 1.1240 0.2969 0.6351 0.2376 0.1064 0.0830 1.5788 1.7067 3.2519 1.4984 0.7186 0.0772 2.2271 0.0319 0.2007 0.2029 0.7293 0.5872 0.0404 0.6368 2.1998 1.4236 28.2926 3.0936 1.0705 0.5101 0.5799 5.8116 0.6287 4.3419 13.5992 3.7751 6.2011 10.2530 7.8141 1.5192 1.0683 10.0905 1.5896 8.7459 27.5002 43.3701 19.1517 8.1410 2.9740 73.7241 4.6471 5.6260 22.9285 12.9287 1.1793 24.3850 1.4528 9.9929 18.1403 1.2580 0.6820 19.1679 5.2101 0.2932 28.2573 10.6100 13.1210 3.1089 28.7034 3.3592 157.7665 1.8853 123.9567 8.7190 73.0004 42.4558 20.8980 35.1040 10.2763 6.2170 39.7197 6.6503 20.4861 14.2971 10.5772 3.5484 179.9197 10.7575 32.1433 1.5110 111.2953 174.9037 18.2976 0.0300 20.5309 186.7907 1.0184 104.1559 5.3737 198.7574 2.0046 125.5120 58.1445 38.1934 2.0094 47.3864 33.7517 0.3315 10.1024 13.6192 22.3450 4.4782 40.3615 8.9126 31.8738 14.6066 26.1302 28.5340 8.7733 16.3266 17.8849 5.1625 18.2117 0.2410 13.1030 63.6547 12.9577 57.5074 90.1112 15.2827 17.7637 5.4920 1.3326 2.7029 159.4899 146.6043 100.6719 178.3004 84.6002 65.4279 22.3012 32.8902 34.4620 26.8212 27.2090 46.7709 38.4395 23.5896 3.5263 27.4641 21.3750 6.9535 15.9008 15.6995 46.7118 96.0778 58.8101 51.0408 49.7663 41.6943 31.9216 0.5864 21.1550 10.4826 38.2007 7.3596 5.8877 4.0523 8.6951 10.0957
temp: 298.150 k
press: 1.00000 atm
elementType: 8 8 8 7 7 6 6 6 6 6 6 6 6 6 6 6 6 6 6 6 6 6 6 6 6 6 6 6 1 1 1 1 1 1 1 1 1 1 1 1 1 1 1 1 1 1 1 1 1 1 1 1 1 1 1 1 1 1 1 1
symmnumber: 1
zpe: 1327288.6 jmol-1
zpe.correction: 0.505538 hartree
zpe.thermalcorrener: 0.534831 hartree
zpe.thermalcorrenthalpy: 0.535775 hartree
zpe.thermalcorrgfe: 0.441278 hartree
zpe.sumelectzpe: -1228.676916 hartree
zpe.sumelectthermal: -1228.647622 hartree
zpe.sumelectthermalent: -1228.646678 hartree
zpe.sumelectthermalfe: -1228.741175 hartree
dipole: 0.0412 3.7304 0.2134
dipole: 3.7367
quadrupole: -154.7464 -172.5107 -161.2677
quadrupole: -4.1244 -4.2679 -7.3814
quadrupole: 8.0952 -9.6691 1.5739 -4.1244 -4.2679 -7.3814
hfenergy: -1229.1824532 hartree
pointgroup: C01 [X(C23H32N2O3)]
dipole: -1.1354424 0.9319694 -0.0593711 debye
polarizability: 303.7564517|-1.191277|285.4912404|-31.0003969|3.5958911|254.2515263 unknown
InChI: InChI=1S/C23H32N2O3/c1-4-7-17-27-22-15-11-14-21(19-22)25(20-12-9-8-10-13-20)23(26)28-18-16-24(5-2)6-3/h8-15,19H,4-7,16-18H2,1-3H3
charge 0 multiplicity 1
60 atoms
O  -0.329565 -1.69198 0.688589
O  -1.076097 3.573736 0.084788
O  1.2318 -2.90585 -0.555033
N  -3.421398 -3.660721 1.429868
N  1.580618 -0.616339 0.003332
C  -2.504454 -2.49726 1.372802
C  -4.241124 -3.733906 2.665079
C  -4.159743 -3.879227 0.15968
C  -1.15688 -2.92886 0.776976
C  -5.335238 -2.642796 2.828755
C  -4.794058 -5.278523 0.055619
C  1.00056 0.513556 0.726248
C  -2.183731 4.674706 -1.762879
C  -1.324747 3.472364 -1.367763
C  0.877993 -1.829035 -0.008594
C  -2.50624 4.686068 -3.275714
C  2.850768 -0.421902 -0.662811
C  0.245895 1.463651 0.003184
C  -0.305564 2.572581 0.690129
C  1.227676 0.656013 2.108892
C  -0.092807 2.725193 2.084631
C  0.669953 1.769363 2.782233
C  -3.378012 5.894455 -3.679472
C  3.549428 0.79958 -0.448387
C  3.420777 -1.396999 -1.528946
C  4.783271 1.038911 -1.087608
C  4.65674 -1.139104 -2.159825
C  5.349243 0.074183 -1.950649
H  -2.332916 -2.11414 2.394945
H  -2.911978 -1.648081 0.776496
H  -4.712178 -4.733252 2.708348
H  -3.546148 -3.684791 3.525008
H  -3.433038 -3.763111 -0.666386
H  -4.945962 -3.099649 -0.006545
H  -0.648984 -3.662661 1.426213
H  -1.26039 -3.368238 -0.230948
H  -4.896256 -1.628092 2.814721
H  -6.091721 -2.700068 2.025025
H  -5.85998 -2.771505 3.793848
H  -4.030418 -6.056716 0.230888
H  -5.609236 -5.422637 0.787492
H  -5.223656 -5.426999 -0.952145
H  -3.122817 4.65471 -1.177276
H  -1.650906 5.604014 -1.48411
H  -1.848172 2.518182 -1.587834
H  -0.355967 3.478896 -1.910258
H  -1.561055 4.701376 -3.855761
H  -3.02745 3.746478 -3.551115
H  0.102127 1.316876 -1.07041
H  1.821183 -0.092038 2.642644
H  -0.529726 3.591548 2.590273
H  0.83362 1.89192 3.858231
H  -2.868466 6.847201 -3.442895
H  -3.598494 5.888037 -4.76232
H  -4.34187 5.88576 -3.137013
H  3.135189 1.560727 0.217394
H  2.907387 -2.344851 -1.689522
H  5.302171 1.986568 -0.904009
H  5.078339 -1.903718 -2.822361
H  6.307905 0.262996 -2.445441
