program: Gaussian 16
title: CAAC1_RuH_C_2_NEW_SP_M06L_GD3, SP CHLOROFORM
version: ES64L-G16RevC.01
method: RM06L
basis: Gen
operation: SP
keyword: #P
keyword: #M06L/CHKBASIS
keyword: 5D
keyword: 7F
keyword: #
keyword: GEOM=CHECK
keyword: GUESS=READ
keyword: GFINPUT
keyword: NOSYMM
keyword: INT=ULTRAFINE
keyword: EMPIRICALDISPERSION=GD3
keyword: SCRF=(PCM,SOLVENT=CHLOROFORM,READ)
keyword: SCF=(VSHIFT=800,NOVARACC,MAXCYCLE=180,CONVER=5)
keyword: SP
title: #P # M06L/CHKBASIS 5D 7F # GEOM=CHECK # GUESS=READ # GFINPUT # NOSYMM
basis: NPDir=0 NMtPBC= 1 NCelOv= 1 NCel= 1 NClECP= 1 NCelD= 1
basis: NCelK= 1 NCelE2= 1 NClLst= 1 CellRange= 0.0.
basis: One-electron integrals computed using PRISM.
basis: 1 Symmetry operations used in ECPInt.
basis: ECPInt: NShTT= 268278 NPrTT= 821669 LenC2= 219901 LenP2D= 467949.
basis: LDataN: DoStor=T MaxTD1=10 Len= 848
basis: Number of processors reduced to 34 by ecpmxn.
basis: NBasis= 2492 RedAO= T EigKep= 1.41D-06 NBF= 2492
basis: NBsUse= 2492 1.00D-06 EigRej= -1.00D+00 NBFU= 2492
hfenergy: -1890.2946406 hartree
pointgroup: C01 [X(C21H33Cl2N1Ru1)]
dipole: 0.4080423 0.1551649 2.2253898 debye
InChI: InChI=1S/C18H27N.C3H5.2ClH.Ru.H/c1-13(2)15-10-8-9-14(3)16(15)19-12-17(4,5)11-18(19,6)7;1-3-2;;;;/h8-10,13H,11H2,1-7H3;3H,1-2H2;2*1H;;/q;;;;+2;/p-2
charge 0 multiplicity 1
58 atoms
C  -2.93312895 0.27031865 -3.48578031
H  -2.88903286 0.42242794 -0.97590149
N  0.15461121 0.19997462 0.72581781
C  0.20675223 -0.06941546 2.23974107
C  0.9226517 1.04960055 3.00848869
H  0.41218392 2.02606554 2.91815157
H  0.93270865 0.7710899 4.08283751
H  1.97676586 1.16006662 2.68435119
C  0.92873052 -1.39132426 2.51524388
H  0.44924927 -2.23611321 1.98396087
H  2.0002564 -1.34420331 2.2337883
H  0.87457392 -1.59837225 3.60473543
C  -1.29258897 -0.16006762 2.57277537
H  -1.59151954 -1.23831154 2.64502707
H  -1.52733402 0.32698486 3.5535931
C  -2.06063505 0.49337255 1.40294143
C  -2.31082153 2.00308974 1.63444839
H  -1.38124723 2.56044819 1.86497889
H  -2.77179089 2.46865418 0.73850997
H  -3.00807454 2.13008676 2.49003265
C  -1.07528508 0.38213215 0.21882541
C  1.41909823 0.30503391 0.00147082
C  2.07005967 1.57190783 -0.02299765
C  1.47069596 2.8564716 0.49543233
H  1.60259914 3.65252507 -0.2645212
H  0.39119277 2.78050701 0.70340703
C  3.35326164 1.65429921 -0.59502179
H  3.85514994 2.63618217 -0.61835093
C  3.98637834 0.53094824 -1.1334886
C  3.31316445 -0.69304923 -1.14616844
H  3.79535426 -1.57061998 -1.60566694
C  2.023281 -0.83807793 -0.5927414
C  1.34126799 -2.19381225 -0.75512398
H  4.99668278 0.61489846 -1.56665216
C  -1.66619638 0.06936995 -4.04367484
H  -1.01968432 0.91924607 -4.32119517
H  -3.65941422 -0.57486137 -3.43988193
C  -3.1582513 1.44435151 -2.67955474
H  -4.12601372 1.5250032 -2.15168501
H  -2.72345959 2.41420252 -2.98330319
H  -1.41971237 -0.91963499 -4.46874406
Ru -1.55985247 0.31868645 -1.74512677
Cl -0.33146487 2.32433704 -2.17895389
Cl -2.18777156 -1.99731561 -1.48596892
C  1.10018183 -2.46786071 -2.25271572
H  0.51285447 -3.39956108 -2.38727722
H  2.06249387 -2.58032753 -2.79682016
H  0.52991413 -1.64582077 -2.73312892
H  0.34923128 -2.15691632 -0.25593173
H  1.98711963 3.19477276 1.41897372
C  -3.41923927 -0.19802226 1.22371056
H  -3.30796738 -1.25412928 0.91228535
H  -4.05861544 0.31705753 0.4744672
H  -3.96611968 -0.16288242 2.19046244
C  2.15293998 -3.35134501 -0.14538508
H  2.36360811 -3.20104367 0.93189798
H  3.12687387 -3.48186042 -0.66369099
H  1.59348825 -4.3046003 -0.25443176
