program: Gaussian 09
title: 000031915
version: EM64L-G09RevD.01
frameworkgroup: C1[X(C21H33N3)]
method: RPBEPBE
basis: SDD
operation: Freq
keyword: #pfreq=noraman
keyword: PBEPBE/SDD
title: #p freq=noraman PBEPBE/SDD
converged: YES YES NO NO
title: Mulliken charges:
elementType: N N N C C C C C C C C C C C C C C C C C C C C C H H H H H H H H H H H H H H H H H H H H H H H H H H H H H H H H H
charge: -0.095670 -0.109998 -0.071067 -0.112492 -0.159253 -0.425777 -0.408888 -0.398890 -0.377528 -0.393387 -0.384445 -0.360631 -0.477831 -0.361978 -0.342198 -0.389653 -0.400428 0.458094 -0.398863 -0.369487 -0.452330 -0.233785 -0.222811 -0.245922 0.196349 0.207876 0.201326 0.193841 0.196439 0.199485 0.192694 0.202743 0.219781 0.194591 0.193619 0.231856 0.208390 0.199279 0.203613 0.190663 0.217339 0.190569 0.209065 0.165765 0.208746 0.165667 0.189687 0.203036 0.190058 0.203575 0.188692 0.212448 0.251931 0.232472 0.223896 0.223560 0.226171
chargesum: 0.00000
title: Mulliken charges with hydrogens summed into heavy atoms:
elementType: N N N C C C C C C C C C C C C C C C C C C C C C
charge: -0.095670 -0.109998 -0.071067 0.083857 0.048623 -0.030610 -0.012964 -0.003453 0.036844 0.032089 0.023223 0.033645 -0.069923 0.012851 0.032214 0.003070 -0.006795 0.458094 0.002277 -0.117556 -0.219858 -0.009889 0.000749 -0.019751
polarizability: 3.06319686e+02 -4.36710174e+00 2.16269417e+02 2.19255639e+01 1.21376766e+00 1.93651020e+02
1716.lowfreq: -3.4609 -0.0011 0.0003 0.0008 2.5973 6.3887 16.4406 25.2430 27.8434
frequency: 15.9610 25.0670 26.7983 32.6404 46.8612 61.6487 74.8780 105.6385 143.9750 158.6021 172.6715 198.9224 208.3735 230.8494 250.2453 264.8455 281.8625 303.8713 312.0948 325.6550 352.2974 379.4614 389.8855 395.2554 405.0314 428.6819 440.5553 446.7435 453.9920 478.5757 505.0063 564.2581 574.5979 600.1192 616.9880 674.1366 703.3849 710.6943 733.0719 763.1392 766.4561 778.8076 791.0407 799.7546 809.8126 816.3848 827.7790 852.9329 855.8356 856.8176 857.3727 906.5696 912.1995 941.6505 942.5217 958.6039 961.0034 967.8046 979.4736 989.9909 991.6773 994.0702 1002.7622 1014.1644 1025.2011 1037.4740 1049.7989 1054.2436 1070.5123 1072.1895 1088.8540 1096.7992 1101.1024 1104.9443 1115.7722 1122.6386 1128.2675 1146.4679 1150.9894 1155.3276 1157.2744 1168.9705 1175.7394 1179.4727 1192.5840 1210.2523 1212.9160 1235.6778 1245.4672 1253.8610 1254.6659 1263.9424 1266.4167 1270.9123 1285.2948 1292.5818 1300.5508 1306.5617 1310.6869 1319.3406 1328.5714 1331.4864 1332.8665 1341.0646 1341.4175 1347.6649 1350.8969 1351.9828 1357.2902 1363.2267 1368.9654 1376.8943 1379.8860 1392.1194 1392.7648 1439.0742 1449.7099 1450.1270 1451.5202 1456.3184 1459.3428 1459.7777 1462.3746 1465.0212 1468.3157 1471.6991 1472.1636 1479.2743 1482.9099 1488.8256 1593.8873 1614.5848 2810.0978 2821.4149 2833.8912 2847.5547 2859.7259 2868.3855 2912.7633 2960.7994 2965.6092 2968.6296 2981.0808 2983.7477 2984.2975 2985.1770 2993.7034 2998.7695 3006.7623 3008.1499 3018.1780 3018.8462 3023.0417 3028.8544 3031.6210 3032.4377 3040.9714 3044.3599 3053.5436 3071.6259 3112.5721 3121.9775 3135.0895 3146.1867 3160.9680
redmass: 4.6275 3.8223 3.4364 3.5854 3.6969 4.1540 3.0268 3.6750 2.6736 3.0283 3.7279 2.5957 3.1616 1.8650 2.1602 3.3934 2.5178 2.1617 2.1402 3.1019 2.2582 2.3326 1.8984 2.0625 2.8160 3.6239 3.0224 3.1693 2.9301 2.8890 3.1436 1.9392 2.4160 4.0724 6.3271 4.8910 2.1728 3.4790 1.9329 3.1264 2.2616 1.6627 2.4815 1.7255 1.7218 3.3784 2.9269 1.7759 1.7039 1.5655 1.3629 2.3552 1.3913 1.8494 2.2516 1.3087 1.8949 1.9649 1.3866 5.7506 2.4824 1.3853 2.3077 2.3583 2.1218 2.0538 2.0556 2.2928 1.8449 1.7536 1.7697 1.6012 1.5774 2.5385 2.0638 2.4317 1.9864 1.6118 1.5927 2.6163 2.2331 1.0626 1.3548 1.1114 1.3545 1.9170 2.0797 1.6730 1.4175 1.3089 1.2732 1.3306 1.1804 1.4070 1.2566 1.4066 1.3979 1.6307 1.3154 1.3451 1.3574 1.3197 1.3263 1.4267 1.3481 1.4718 1.4497 1.4223 1.3517 1.4605 1.5717 1.5289 2.2042 1.4297 2.0690 2.0428 1.0872 1.0908 1.0854 1.1022 1.0877 1.0882 1.1000 1.0865 1.0921 1.0934 1.1361 1.0969 2.1085 1.0851 6.1560 6.1819 1.0715 1.0699 1.0707 1.0709 1.0692 1.0698 1.0663 1.0622 1.0626 1.0619 1.0859 1.0611 1.0618 1.0682 1.0836 1.0850 1.0882 1.0873 1.0987 1.0881 1.0996 1.0932 1.0887 1.0947 1.0890 1.1021 1.1034 1.0971 1.0867 1.0862 1.0915 1.0954 1.1014
irintensity: 0.0379 0.1109 0.0721 0.3017 0.0081 0.0005 0.2489 0.9452 0.7087 1.7920 1.1070 1.6693 0.6915 0.7445 0.1234 0.0437 0.9311 3.1064 1.2934 6.2711 0.5614 2.4635 3.7141 0.0902 0.3849 1.0188 2.0094 5.8257 8.2510 6.5904 0.8451 2.5507 5.1687 3.4550 0.1544 0.0047 36.1224 1.9010 38.2994 7.9337 36.2405 9.5602 1.3072 4.5169 3.3219 3.4798 7.5843 2.1982 1.8934 7.6057 0.0665 4.0604 7.1732 4.2636 18.4279 3.8150 0.4150 1.5894 0.5352 0.2310 32.5753 0.2229 33.7060 15.7817 8.4609 0.3737 13.6408 9.8687 37.3940 17.2183 32.2239 0.1865 12.9843 5.1937 18.7497 5.9281 15.4519 3.0999 9.1864 45.5303 24.2803 0.7335 9.2232 2.9721 11.9843 2.8816 4.4500 5.2320 1.4304 26.3435 3.6154 10.9944 13.3048 0.9367 1.4642 17.6570 10.6999 14.5553 3.7964 1.6937 7.9885 0.4392 1.1548 0.3091 12.2779 0.6454 1.4540 2.6139 0.2830 1.7214 16.9975 1.4545 7.2378 0.4668 2.6828 14.5990 0.9784 10.0616 4.4088 3.7693 6.6650 12.0436 15.2105 7.0992 18.6889 7.4238 8.6265 1.4649 12.5860 8.4659 0.9958 6.5109 45.4346 134.7541 51.4585 50.0878 147.0389 106.8867 73.8407 24.2704 39.8225 18.3565 20.1470 38.0201 29.4907 109.1993 61.1726 49.4940 42.6493 1.8915 25.9149 35.3231 61.5627 73.0456 46.4581 59.5929 60.4285 6.3449 101.3338 56.4091 7.9012 0.0700 19.6656 37.6994 27.3008
temp: 298.150 k
press: 1.00000 atm
elementType: 7 7 7 6 6 6 6 6 6 6 6 6 6 6 6 6 6 6 6 6 6 6 6 6 1 1 1 1 1 1 1 1 1 1 1 1 1 1 1 1 1 1 1 1 1 1 1 1 1 1 1 1 1 1 1 1 1
symmnumber: 1
zpe: 1329107.6 jmol-1
zpe.correction: 0.506230 hartree
zpe.thermalcorrener: 0.528540 hartree
zpe.thermalcorrenthalpy: 0.529484 hartree
zpe.thermalcorrgfe: 0.452471 hartree
zpe.sumelectzpe: -982.384962 hartree
zpe.sumelectthermal: -982.362653 hartree
zpe.sumelectthermalent: -982.361709 hartree
zpe.sumelectthermalfe: -982.438721 hartree
dipole: 0.6386 -0.4120 -0.3105
dipole: 0.8210
quadrupole: -143.7429 -143.6362 -144.6501
quadrupole: -1.2833 1.6048 -1.2403
quadrupole: 0.2669 0.3735 -0.6404 -1.2833 1.6048 -1.2403
hfenergy: -982.8911925 hartree
pointgroup: C01 [X(C21H33N3)]
dipole: 0.251443 0.1520624 -0.1341075 debye
polarizability: 306.4520352|-20.4202321|194.9140039|-8.2626774|-5.5575353|214.8740835 unknown
InChI: InChI=1S/C21H33N3/c1-3-8-19(9-4-1)16-23-17-20-10-7-11-21(18-23)24(20)15-14-22-12-5-2-6-13-22/h1,3-4,8-9,20-21H,2,5-7,10-18H2
charge 0 multiplicity 1
57 atoms
N  0.784938 0.048419 -0.060142
N  -1.999408 -0.54924 -0.587812
N  4.591067 0.067005 -0.237758
C  0.356097 -1.36968 -0.261454
C  -0.281046 0.764697 0.701401
C  0.154096 -2.11902 1.092504
C  -0.504092 0.143934 2.114424
C  -0.894305 -1.351546 -1.171498
C  -1.5455 0.807703 -0.187238
C  -0.807467 -1.376337 2.058056
C  2.166684 0.235224 0.440946
C  3.189761 0.159476 -0.717358
C  -3.176014 -0.503953 -1.485233
C  5.519948 -0.372608 -1.310486
C  5.067618 1.323633 0.395953
C  6.937719 -0.616594 -0.754318
C  6.473015 1.142584 1.005861
C  -4.441651 0.010284 -0.805226
C  7.478381 0.655445 -0.061471
C  -4.786256 -0.418727 0.502007
C  -5.318452 0.889577 -1.486524
C  -5.982647 0.018117 1.111215
C  -6.520141 1.326398 -0.881756
C  -6.85689 0.891165 0.420218
H  1.151399 -1.890433 -0.830327
H  0.048509 1.815105 0.828583
H  1.146688 -2.232695 1.574163
H  -0.21785 -3.144163 0.897634
H  -1.323442 0.677162 2.635719
H  0.417584 0.31589 2.708288
H  -0.574957 -0.941832 -2.16392
H  -1.26022 -2.385168 -1.32878
H  -2.370247 1.307279 0.353601
H  -1.301919 1.425716 -1.089144
H  -0.729644 -1.813376 3.073487
H  -1.84246 -1.518639 1.705555
H  2.21199 1.232214 0.919098
H  2.473702 -0.506478 1.214241
H  2.978848 -0.751778 -1.30914
H  3.025518 1.030814 -1.400321
H  -3.351727 -1.540262 -1.840722
H  -2.975542 0.11471 -2.399096
H  5.120303 -1.304066 -1.754285
H  5.579272 0.389633 -2.134355
H  4.356252 1.617354 1.18826
H  5.095297 2.161413 -0.353474
H  7.608635 -0.929739 -1.577688
H  6.892654 -1.445459 -0.021476
H  6.807617 2.100274 1.449779
H  6.410332 0.396992 1.822059
H  7.62548 1.452693 -0.819867
H  8.466677 0.459064 0.396022
H  -4.097797 -1.086661 1.031942
H  -5.058323 1.237051 -2.494488
H  -6.235755 -0.321411 2.122393
H  -7.187425 2.007563 -1.42234
H  -7.786102 1.229976 0.892387
