program: Gaussian 09
title: 000031829
version: EM64L-G09RevD.01
frameworkgroup: C1[X(C15H20O7)]
method: RPBEPBE
basis: SDD
operation: Freq
keyword: #pfreq=noraman
keyword: PBEPBE/SDD
title: #p freq=noraman PBEPBE/SDD
converged: NO YES NO NO
title: Mulliken charges:
elementType: O O O O O O O C C C C C C C C C C C C C C C H H H H H H H H H H H H H H H H H H H H
charge: -0.280195 -0.235342 -0.423817 -0.452861 -0.429736 -0.455707 -0.189108 0.258809 0.375009 0.203934 -0.335110 -0.201512 -0.488082 -0.133161 -0.204071 -0.855974 -0.214572 -0.505791 -0.374185 -0.044305 0.326064 -0.786660 0.270426 0.215369 0.223348 0.259067 0.282062 0.271991 0.258028 0.263286 0.226529 0.283233 0.242315 0.238768 0.243496 0.348586 0.352714 0.364701 0.384064 0.244116 0.251312 0.222962
chargesum: 0.00000
title: Mulliken charges with hydrogens summed into heavy atoms:
elementType: O O O O O O O C C C C C C C C C C C C C C C
charge: -0.280195 -0.235342 -0.075232 -0.100147 -0.065035 -0.071643 -0.189108 0.258809 0.375009 0.203934 -0.064684 0.013857 -0.005667 0.148901 0.067921 -0.108130 0.068661 -0.024708 -0.130689 -0.044305 0.326064 -0.068270
polarizability: 2.05108318e+02 2.34743186e+00 1.70562871e+02 5.72571770e-01 -1.31997452e+00 1.44919521e+02
1716.lowfreq: -17.4409 -0.0008 -0.0003 0.0004 4.2022 8.5612 62.8672 77.8500 96.0941
frequency: 62.8190 77.8104 96.0924 98.5207 116.1091 127.1461 133.1448 141.6378 155.5040 185.7610 196.8357 226.4402 232.0769 245.9828 254.2302 262.8868 271.3454 284.4978 291.9332 294.1059 308.9453 326.7592 330.9318 337.2270 369.3996 372.9178 374.8596 404.9769 443.9261 455.5221 472.4375 484.0682 514.3515 522.2172 577.5727 600.5646 612.2649 632.6336 670.3572 683.5266 747.5943 769.2022 790.7778 811.1494 819.6631 846.9641 862.3347 870.5048 882.8060 895.7223 912.3508 917.1725 930.7415 950.3908 979.4120 996.1904 1000.5340 1014.0745 1030.2690 1035.2337 1046.3627 1052.3375 1054.2363 1075.2340 1092.2952 1112.4192 1128.3679 1143.0168 1151.1390 1160.1710 1183.2729 1197.0655 1205.6492 1212.7100 1235.6539 1244.5083 1253.9707 1265.3528 1283.9207 1297.8849 1300.9987 1309.5668 1337.6627 1342.2239 1351.4375 1363.5692 1380.0201 1381.8286 1397.3000 1399.4936 1402.9938 1409.1127 1449.9739 1465.1971 1468.1728 1470.3340 1485.5985 1500.5208 1588.2374 1661.2631 2976.5690 2982.4437 2987.4606 2995.7804 2999.6864 3009.5836 3033.6779 3066.0881 3068.0770 3069.6534 3080.5484 3087.7049 3100.9113 3120.7395 3122.6845 3175.6753 3453.9166 3554.7478 3569.8426 3573.7478
redmass: 6.0845 5.0696 4.6932 2.8039 2.0006 1.4726 3.7105 4.3407 1.7220 1.7892 2.3143 4.4665 3.5867 3.3527 3.2436 3.6614 3.4405 3.1118 3.3915 3.1425 4.7052 3.0665 2.9151 4.6359 1.4490 3.2369 1.9484 4.5850 5.2975 4.6386 5.6326 3.9776 3.2496 5.6287 4.7835 2.7095 1.9150 2.3345 4.9269 3.9707 4.2611 4.8678 3.4875 3.6093 5.1643 4.1560 2.8241 2.6427 2.9972 2.5249 2.1098 2.2067 2.3082 4.6350 4.8901 3.4392 3.1116 2.4236 3.5220 2.3634 2.3082 1.5815 1.4816 2.8154 2.9052 1.6976 1.9227 1.7388 2.9088 2.8802 1.3680 1.3778 1.3069 1.2869 2.0777 2.1432 1.5242 1.2984 1.3472 1.2536 1.4231 1.7129 1.2303 1.3039 1.9417 1.4289 1.3278 1.2543 1.2426 2.6181 1.4570 1.1718 1.0451 1.0718 1.0698 1.0831 1.2508 1.0562 10.1494 7.1089 1.0835 1.0834 1.0367 1.0396 1.0620 1.0848 1.0828 1.0544 1.0962 1.1032 1.0896 1.0967 1.1009 1.0970 1.0917 1.1176 1.0641 1.0667 1.0658 1.0662
irintensity: 7.6024 0.9744 1.9195 9.4397 9.3820 1.7534 0.6801 9.0402 132.6222 14.3965 19.2859 1.7589 0.1075 14.5201 14.4635 2.1337 4.6735 3.6440 28.3733 38.0016 8.3254 100.9058 32.1832 12.6979 140.1873 11.8528 18.6125 4.3700 4.9041 11.8636 7.8544 5.4280 2.3037 4.0958 1.6612 44.0301 55.6300 54.3892 11.6848 29.6534 11.1904 12.5335 5.5036 10.9240 12.5142 2.8049 27.7098 13.9571 17.4271 53.4940 22.4801 25.8166 44.2373 14.8394 27.2340 128.6917 18.7386 27.9701 92.5820 48.9673 4.2544 8.8295 5.6773 6.6101 10.8519 1.7865 11.6912 27.7414 9.1270 6.9583 45.8855 26.9044 6.1197 22.4247 8.0797 15.0380 27.1540 5.3597 13.2126 6.4622 15.3143 13.0865 14.5337 6.1285 26.5780 0.9445 14.0326 13.2576 19.8186 1.8755 7.7336 47.0547 14.3856 5.4269 16.1469 3.6752 15.0555 10.3759 149.7983 9.0967 3.0306 30.5926 16.8012 17.9663 37.9041 16.9475 9.4034 15.3506 10.7669 25.6001 19.0851 11.6775 11.9249 2.1309 16.9108 7.4883 65.6496 20.9579 9.6143 12.4761
temp: 298.150 k
press: 1.00000 atm
elementType: 8 8 8 8 8 8 8 6 6 6 6 6 6 6 6 6 6 6 6 6 6 6 1 1 1 1 1 1 1 1 1 1 1 1 1 1 1 1 1 1 1 1
symmnumber: 1
zpe: 874494.4 jmol-1
zpe.correction: 0.333077 hartree
zpe.thermalcorrener: 0.354544 hartree
zpe.thermalcorrenthalpy: 0.355488 hartree
zpe.thermalcorrgfe: 0.286053 hartree
zpe.sumelectzpe: -1108.357675 hartree
zpe.sumelectthermal: -1108.336208 hartree
zpe.sumelectthermalent: -1108.335264 hartree
zpe.sumelectthermalfe: -1108.404699 hartree
dipole: -1.6393 3.4920 -1.4007
dipole: 4.1040
quadrupole: -143.7255 -127.8182 -127.0237
quadrupole: -6.5725 4.4043 7.4192
quadrupole: -10.8697 5.0376 5.8321 -6.5725 4.4043 7.4192
hfenergy: -1108.6907519 hartree
pointgroup: C01 [X(C15H20O7)]
dipole: 0.6491473 1.3275175 0.6506854 debye
polarizability: 204.659911|-3.572429|170.5743258|4.0425002|2.2306606|145.3564738 unknown
InChI: InChI=1S/C15H20O7/c1-6-3-7-14(4-16,11(20)8(6)17)13(2)10(19)9(18)12(22-7)15(13)5-21-15/h3,7,9-12,16,18-20H,4-5H2,1-2H3
charge 0 multiplicity 1
42 atoms
O  -2.728797 -0.848134 -1.969961
O  -0.28156 1.810058 -0.825914
O  -3.486563 -0.480338 1.392605
O  -2.268552 2.607853 1.059486
O  1.233137 -2.247516 -0.887403
O  1.327016 -2.135577 1.890774
O  3.652286 -1.224838 0.072546
C  -1.236097 -0.746456 0.189785
C  -1.584996 -0.217715 -1.216392
C  0.273074 -0.307947 0.480728
C  -1.654183 1.29203 -1.027178
C  -2.202068 0.15166 1.094301
C  -1.314849 -0.882265 -2.518573
C  -2.529345 1.413075 0.253761
C  0.36771 1.262167 0.411662
C  -1.523344 -2.246958 0.370983
C  1.305309 -0.837341 -0.586586
C  0.717638 -0.783438 1.905967
C  1.775715 1.81408 0.357098
C  2.71551 -0.397165 -0.127551
C  2.893032 1.071366 0.097733
C  4.300417 1.620271 0.09821
H  -2.041715 1.844035 -1.89815
H  -1.710734 0.453309 2.041309
H  -1.162457 -0.26717 -3.414856
H  -0.847081 -1.873213 -2.524523
H  -3.596182 1.351701 -0.037402
H  -0.164044 1.709898 1.275941
H  -2.586195 -2.437065 0.147336
H  -0.917143 -2.848661 -0.321377
H  -1.29361 -2.593603 1.395523
H  1.103798 -0.322006 -1.54287
H  -0.151432 -0.861559 2.579462
H  1.429509 -0.061869 2.351366
H  1.865856 2.892832 0.538673
H  -3.339607 -1.285181 1.950341
H  -2.308936 3.409458 0.479813
H  1.372028 -2.72883 -0.024689
H  2.315255 -2.056024 1.895613
H  4.764415 1.504747 -0.898997
H  4.937108 1.053874 0.801351
H  4.318878 2.688155 0.372354
