program: Gaussian 09
title: 000003416
version: EM64L-G09RevD.01
frameworkgroup: C1[X(C18H22O8P2)]
method: RPBEPBE
basis: SDD
operation: Freq
keyword: #p
keyword: freq=noraman
keyword: PBEPBE/SDD
title: #p freq=noraman PBEPBE/SDD
converged: YES YES NO NO
title: Mulliken charges:
elementType: P P O O O O O O O O C C C C C C C C C C C C C C C C C C H H H H H H H H H H H H H H H H H H H H H H
charge: 1.336583 1.336807 -0.545006 -0.544651 -0.643222 -0.641889 -0.643212 -0.641801 -0.587651 -0.587933 0.155245 0.158477 -0.536031 -0.535511 0.334353 0.335631 -0.687811 -0.687901 -0.391791 -0.392109 -0.372368 -0.372452 -0.380143 -0.380454 -0.359558 -0.360332 0.354674 0.354182 0.245844 0.215331 0.214594 0.245522 0.219883 0.231920 0.212189 0.212506 0.219791 0.231773 0.239826 0.239285 0.245497 0.245771 0.259551 0.259432 0.288468 0.288736 0.401690 0.403237 0.401773 0.403256
chargesum: 0.00000
title: Mulliken charges with hydrogens summed into heavy atoms:
elementType: P P O O O O O O O O C C C C C C C C C C C C C C C C C C
charge: 1.336583 1.336807 -0.545006 -0.544651 -0.241532 -0.238652 -0.241439 -0.238545 -0.587651 -0.587933 0.155245 0.158477 -0.074856 -0.075395 0.334353 0.335631 -0.023819 -0.023830 -0.151965 -0.152824 -0.126872 -0.126681 -0.120592 -0.121022 -0.071090 -0.071596 0.354674 0.354182
polarizability: 4.42925682e+02 1.30412185e+01 2.19819970e+02 6.64663686e-02 -2.30461709e-01 2.08321984e+02
1716.lowfreq: -10.1751 -2.8038 -0.0014 -0.0011 -0.0010 0.9999 13.7696 15.5431 17.9279
frequency: 13.7321 14.7405 17.9244 18.0757 31.2722 38.9306 46.3724 49.9868 55.8329 59.8681 67.4649 82.7512 84.7314 88.7343 95.3981 140.5158 140.5773 150.2544 177.7161 188.0310 197.2879 212.5831 220.2774 233.1998 239.6413 249.1137 249.6723 285.0762 294.3154 315.0619 316.2836 326.7107 330.1308 335.9141 340.1915 350.8419 370.4307 390.7344 405.2330 412.6448 413.6303 425.7235 433.9774 491.7875 508.2701 526.9960 535.4263 568.0228 605.1527 611.1241 626.4379 632.0712 667.6144 676.0214 696.1437 727.4057 734.2774 740.0744 749.6036 752.3282 757.9514 775.7969 815.2917 836.2952 836.8191 843.3370 843.9730 850.0709 857.9824 911.5395 943.4113 958.3519 960.7106 973.7411 974.3378 1004.8298 1006.4272 1012.0239 1012.1636 1018.6584 1034.5328 1034.7082 1049.5702 1061.3922 1062.1392 1067.1160 1083.1996 1092.5950 1108.2408 1114.1806 1124.4819 1159.0335 1161.2472 1193.4094 1194.1883 1242.5510 1249.1288 1275.6346 1281.8351 1297.9824 1305.0184 1316.5418 1320.4872 1351.2206 1355.6197 1385.8743 1387.0104 1405.2304 1405.6272 1469.5438 1470.2278 1472.1831 1472.5196 1483.6582 1483.9515 1486.1536 1489.0038 1575.2951 1575.8350 1605.1429 1607.1376 1625.2436 2972.4210 2973.3481 2979.3311 2979.9363 3055.1172 3055.6240 3074.4574 3075.0402 3084.6590 3085.2348 3139.2904 3139.7135 3142.4041 3142.6178 3161.7076 3161.8285 3174.3271 3174.5268 3594.8970 3595.0282 3598.0519 3598.2073
redmass: 8.4755 5.9456 6.6669 6.6796 5.7290 5.2402 4.6823 3.2828 2.1904 1.9097 2.5812 2.5994 2.8422 3.2875 4.3828 8.4302 6.5301 2.4545 1.2802 1.4006 2.7736 3.2013 4.4682 2.1937 2.2202 1.7860 1.8898 3.2540 3.2059 3.0969 6.0152 4.2157 6.1234 6.6104 6.5959 3.8934 5.4921 4.5612 6.1340 3.0156 3.1500 4.7508 7.9405 4.1491 4.0689 3.7414 3.9326 4.9271 3.4468 5.7639 6.5677 6.8905 8.1680 4.5711 7.0895 6.9657 3.4584 3.9985 4.9050 7.5388 2.6617 1.2411 1.6574 1.2997 1.2912 5.5427 6.4663 1.6095 1.7358 2.4109 1.8907 1.3597 1.4341 1.3469 1.3515 3.2141 2.9535 1.3846 1.3796 2.2946 1.3404 1.3403 2.3138 4.0563 4.1372 1.8155 2.0092 1.7414 1.6796 1.6677 1.5667 2.2944 2.2938 1.3820 1.4022 1.8639 1.2779 1.8106 2.3145 1.2920 1.4097 1.5141 1.4173 5.3318 6.3930 1.2000 1.2061 3.5161 3.5415 1.0646 1.0613 1.0591 1.0482 1.2786 1.1030 1.7592 2.3588 7.3670 7.3611 6.3851 6.4054 8.6792 1.0665 1.0666 1.0351 1.0353 1.0930 1.0930 1.1002 1.1002 1.0995 1.0994 1.0891 1.0890 1.0884 1.0884 1.0968 1.0968 1.0959 1.0960 1.0665 1.0665 1.0662 1.0663
irintensity: 0.0632 0.8068 0.0678 0.5819 0.0058 21.1851 0.0572 23.4651 5.1251 150.1082 7.2949 7.7857 3.7457 0.1492 21.5973 2.1389 11.7296 0.6173 0.0521 0.1372 14.9514 6.1881 20.8507 80.6417 48.1727 75.9866 32.7073 57.3650 3.5332 22.8772 1.8743 4.2228 104.7551 27.3984 10.2877 15.2013 16.3393 10.7063 121.6293 0.6865 4.5512 26.6137 0.1426 0.1232 3.4796 31.4356 32.5101 10.9029 0.1911 11.2138 7.5105 0.0173 20.7514 8.5455 205.9235 37.2482 0.7653 32.8929 292.5243 61.0726 485.2618 0.0800 60.3285 12.2165 10.7487 500.1917 29.8384 40.6966 110.5824 3.9776 5.2807 2.7298 0.0658 0.9098 0.5365 0.0871 67.4513 20.2296 17.9036 0.0486 141.3507 14.6718 4.7242 49.3301 285.9524 2.5581 13.0355 25.9170 9.0135 2.0697 3.4800 406.9408 5.2951 98.6731 20.7368 0.5319 0.0483 33.5215 0.8170 0.5717 0.3667 0.9735 15.8465 1.9153 0.7892 8.7778 21.0410 2.8247 1.7597 3.7391 7.0761 0.5513 5.5445 9.0114 49.6847 1.2985 297.0612 0.8688 6.3368 1.6550 43.6511 0.0154 21.4302 26.9493 33.4933 28.6599 4.5950 6.1347 57.2818 29.1882 3.8105 108.1771 11.1911 10.5696 9.7987 4.6947 2.1803 1.9717 4.0919 3.5635 78.0872 64.4516 155.7856 72.4578
temp: 298.150 k
press: 1.00000 atm
elementType: 15 15 8 8 8 8 8 8 8 8 6 6 6 6 6 6 6 6 6 6 6 6 6 6 6 6 6 6 1 1 1 1 1 1 1 1 1 1 1 1 1 1 1 1 1 1 1 1 1 1
symmnumber: 1
zpe: 974044.5 jmol-1
zpe.correction: 0.370994 hartree
zpe.thermalcorrener: 0.402920 hartree
zpe.thermalcorrenthalpy: 0.403864 hartree
zpe.thermalcorrgfe: 0.302084 hartree
zpe.sumelectzpe: -1981.243621 hartree
zpe.sumelectthermal: -1981.211695 hartree
zpe.sumelectthermalent: -1981.210751 hartree
zpe.sumelectthermalfe: -1981.312531 hartree
dipole: -0.0132 -0.0058 -0.2828
dipole: 0.2832
quadrupole: -173.9341 -165.5563 -185.0263
quadrupole: 0.8981 0.0221 -0.0425
quadrupole: 0.9048 9.2826 -10.1874 0.8981 0.0221 -0.0425
hfenergy: -1981.6146148 hartree
pointgroup: C01 [X(C18H22O8P2)]
dipole: -0.0054167 0.0057472 0.1111438 debye
polarizability: 443.6342665|-3.3735751|219.0838173|0.3229482|-0.5923968|208.3495521 unknown
InChI: InChI=1S/C18H22O8P2/c1-3-17(13-5-9-15(10-6-13)25-27(19,20)21)18(4-2)14-7-11-16(12-8-14)26-28(22,23)24/h5-12,19-20,22-23H,3-4H2,1-2H3
charge 0 multiplicity 1
50 atoms
P  -7.185471 -0.624142 -0.4091
P  7.187413 0.599822 -0.431648
O  -6.143464 0.663161 0.05917
O  6.145163 -0.657829 0.110823
O  -8.685174 0.187308 -0.296801
O  -7.226707 -1.56545 1.016066
O  8.687258 -0.20084 -0.26172
O  7.220456 1.62838 0.932035
O  -6.878328 -1.390913 -1.765612
O  6.885554 1.280742 -1.834395
C  -0.381731 0.582141 0.261107
C  0.382787 -0.565026 0.297969
C  0.21308 1.99084 0.307073
C  -0.215574 -1.966747 0.428278
C  -1.882582 0.544187 0.213142
C  1.883386 -0.531521 0.25102
C  -0.029178 2.813249 -0.985786
C  0.029782 -2.866952 -0.810966
C  -2.660702 1.222544 1.192409
C  2.66016 -1.165802 1.260655
C  -2.573676 -0.116749 -0.838916
C  2.576851 0.080248 -0.828977
C  -4.069361 1.21806 1.144792
C  4.068845 -1.164102 1.214614
C  -3.983057 -0.117053 -0.91962
C  3.986201 0.076371 -0.907871
C  -4.714704 0.549789 0.085682
C  4.71636 -0.544142 0.127786
H  1.29406 1.943182 0.521593
H  -0.250202 2.541086 1.151903
H  0.242068 -2.465219 1.307463
H  -1.297249 -1.903057 0.634736
H  0.380467 3.834462 -0.879896
H  -1.10776 2.899051 -1.208704
H  0.458258 2.339874 -1.857769
H  -0.450925 -2.44456 -1.712293
H  -0.385134 -3.878114 -0.645908
H  1.109104 -2.970548 -1.022479
H  -2.161092 1.736265 2.020965
H  2.160127 -1.641886 2.111167
H  -1.99657 -0.62021 -1.621738
H  2.000977 0.547258 -1.63489
H  -4.67148 1.717595 1.909058
H  4.669485 -1.62924 2.001423
H  -4.498146 -0.619378 -1.745046
H  4.501897 0.539679 -1.75549
H  -8.881852 0.810402 -1.041788
H  -7.540636 -2.496155 0.883701
H  8.888418 -0.868985 -0.965326
H  7.524096 2.552323 0.741212
