program: Gaussian 09
title: 000031676
version: EM64L-G09RevD.01
frameworkgroup: C1[X(C7H14N2)]
method: RPBEPBE
basis: SDD
operation: Freq
keyword: #pfreq=noraman
keyword: PBEPBE/SDD
title: #p freq=noraman PBEPBE/SDD
converged: YES YES NO NO
title: Mulliken charges:
elementType: N N C C C C C C C H H H H H H H H H H H H H H
charge: -0.571410 -0.020822 -0.370799 -0.359198 -0.355063 -0.378393 -0.392511 -0.430475 -0.157371 0.193950 0.192452 0.193553 0.197614 0.219064 0.181766 0.220477 0.221424 0.207264 0.178798 0.248536 0.247584 0.274375 0.259185
chargesum: 0.00000
title: Mulliken charges with hydrogens summed into heavy atoms:
elementType: N N C C C C C C C
charge: -0.037849 -0.020822 0.015603 0.031968 0.045768 0.063508 -0.006449 0.065644 -0.157371
polarizability: 1.18890663e+02 -6.73525039e+00 7.49032998e+01 -9.98456778e-01 -1.02306946e+00 6.57894004e+01
1716.lowfreq: 0.0005 0.0007 0.0009 3.9714 8.6376 33.0674 40.0255 63.8501 71.7113
frequency: 39.0504 63.8441 71.6124 97.7129 133.2575 145.0409 149.2648 231.6239 242.5338 291.7771 373.1112 411.1434 469.0529 542.9286 601.5651 726.8914 743.8473 787.1525 866.1123 920.1527 944.8709 976.6884 1007.3923 1040.9748 1054.8849 1077.9617 1095.1642 1114.2167 1123.9330 1198.0793 1220.5938 1245.3714 1268.3340 1282.0905 1285.0852 1295.0852 1297.9426 1319.6338 1347.4768 1359.0970 1390.2886 1448.2019 1464.0283 1465.6932 1473.6340 1485.0192 1493.7152 1638.1970 2197.3509 2859.7099 2955.1190 2956.9977 2964.9346 2985.9896 2994.3609 2996.1906 3008.1361 3017.3227 3035.5145 3046.5950 3065.9110 3453.9065 3581.4820
redmass: 4.1264 4.8353 1.9687 2.5364 1.9729 4.2111 2.2786 1.2637 3.8058 3.2780 3.5187 3.2212 3.5946 4.6616 1.2897 1.0715 1.1125 1.1830 1.2667 5.5784 1.7907 1.5142 4.2179 2.3698 3.0953 2.2323 2.7526 1.8920 1.4688 1.4501 1.3175 1.3527 1.2231 1.0792 1.2235 1.1016 1.1289 1.3533 1.4411 1.6351 1.4632 1.0824 1.0783 1.0630 1.0905 1.0967 1.0911 1.0942 12.4301 1.0717 1.0594 1.0623 1.0616 1.0592 1.0961 1.0599 1.0861 1.1007 1.1013 1.1024 1.1045 1.0448 1.0975
irintensity: 4.1478 3.5958 5.1023 1.3573 0.9212 3.9729 1.3436 41.1666 2.9589 17.5376 0.4922 3.1808 17.6057 5.6291 224.3393 13.1030 1.2640 1.3909 0.1065 0.2811 0.4557 0.6352 2.6478 0.7575 3.9936 0.0665 1.4335 13.1499 11.1788 5.7172 3.4915 3.4858 0.6167 1.2520 2.1951 0.7116 2.2913 2.2305 1.6976 0.2579 16.4467 7.0428 1.0478 0.4879 0.1067 15.4839 8.0784 40.0878 16.1244 114.8041 1.0004 1.9897 83.8415 0.1299 0.0020 47.2491 38.5373 3.4344 0.9397 81.3835 85.9096 1.5365 0.1887
temp: 298.150 k
press: 1.00000 atm
elementType: 7 7 6 6 6 6 6 6 6 1 1 1 1 1 1 1 1 1 1 1 1 1 1
symmnumber: 1
zpe: 528993.8 jmol-1
zpe.correction: 0.201483 hartree
zpe.thermalcorrener: 0.213008 hartree
zpe.thermalcorrenthalpy: 0.213952 hartree
zpe.thermalcorrgfe: 0.163175 hartree
zpe.sumelectzpe: -383.888436 hartree
zpe.sumelectthermal: -383.876911 hartree
zpe.sumelectthermalent: -383.875967 hartree
zpe.sumelectthermalfe: -383.926744 hartree
dipole: -4.3995 1.0604 -0.9354
dipole: 4.6212
quadrupole: -82.4680 -56.4395 -55.3668
quadrupole: 11.7159 5.6231 -1.9560
quadrupole: -17.7099 8.3186 9.3913 11.7159 5.6231 -1.9560
hfenergy: -384.0899189 hartree
pointgroup: C01 [X(C7H14N2)]
dipole: 1.730826 -0.3802587 -0.406394 debye
dipolederiv: -0.6735442 0.1473031 -0.017075 0.1707863 -0.4782675 0.2533921 -0.0560693 0.2522516 -0.4760208 -0.3729578 -0.0025859 0.0012384 0.1032708 -0.2363254 -0.0009491 0.000886 0.0001368 -0.2404279 -0.0623258 0.001093 0.0053837 0.035028 0.0858851 -0.0055299 -0.0003008 -0.0064158 0.1840889 -0.0417952 -0.0202918 0.0040156 -0.0498709 0.0916188 0.0020313 0.0011403 0.0008326 0.1892089 -0.0927012 -0.0208559 0.0171612 -0.1235166 0.0583074 0.0224399 -0.0079637 0.0452072 0.1697684 0.0916542 0.0390562 0.0013398 0.1108995 0.0507105 -0.0018043 0.0004986 -0.0016688 0.1685987 0.5323808 -0.2032003 0.0489755 -0.0963814 0.3181561 -0.1149721 -0.0297879 -0.0838747 0.3378101 -0.1162905 0.048217 0.0033931 0.0363919 0.1412005 -0.0000965 0.0032983 -0.0000063 0.2472892 0.1681405 -0.1235393 -0.0019362 -0.2398076 -0.012698 0.0021184 -0.0018386 0.0010464 -0.0634041 0.0411034 0.0070355 0.010519 0.0065864 -0.0394897 -0.1137553 0.0137899 -0.1374326 -0.0854908 0.0433934 0.0057439 -0.011994 0.0090561 -0.0431767 0.1142254 -0.0164398 0.1385111 -0.0871887 0.0364272 0.0034897 0.0021372 0.0029937 -0.0405648 -0.1138912 -0.0015124 -0.137346 -0.088312 0.0369772 0.0061009 -0.0038081 0.0029724 -0.0400969 0.1121224 0.0013349 0.1351754 -0.0831979 0.0578265 -0.0016122 0.0045036 0.0024167 -0.0348941 0.1127663 0.002764 0.1214456 -0.0666876 0.0360131 0.0068606 -0.0029256 0.0122317 -0.0429856 -0.1207499 0.0238019 -0.1456677 -0.1035591 0.0437292 -0.0091085 -0.0046649 -0.0010183 -0.0161889 0.1006858 -0.0137327 0.1187435 -0.0626858 0.0442768 -0.0115641 0.0022626 -0.0027043 -0.0149094 -0.1000542 0.0119434 -0.1174667 -0.0629426 0.032489 0.0241825 0.0015228 0.0247518 -0.0363959 -0.1043917 -0.0074318 -0.1381641 -0.0992583 -0.0762004 0.0848649 -0.0474738 0.072344 -0.1408829 0.1493083 -0.0621857 0.2029317 -0.135641 0.05462 0.0297959 -0.0058353 0.0083467 0.0303759 0.0752189 0.0080382 0.1058741 -0.0107361 0.0541997 0.0281198 0.0048912 0.0073653 0.0300335 -0.0757148 -0.0090274 -0.1070101 -0.0118308 -0.0040153 -0.0609716 0.008344 -0.1306059 0.1336794 -0.0819096 0.1105556 -0.0603256 0.3121899 0.1665991 0.0218666 -0.0199748 0.0384639 0.2369088 -0.1104902 0.028239 -0.1867779 0.0684294 unknown
polarizability: 119.0645321|-6.1911355|74.6429687|0.0356204|1.4707092|65.8758625 unknown
InChI: InChI=1S/C7H14N2/c8-6-4-2-1-3-5-7-9/h1-6,8H2
charge 0 multiplicity 1
23 atoms
N  5.033085 -0.158218 -0.047241
N  -4.912332 0.524719 0.040477
C  1.206736 0.421329 -0.012994
C  -0.012595 -0.527953 -0.004048
C  2.555236 -0.332072 -0.024926
C  -1.358088 0.229959 0.010676
C  3.773838 0.613277 -0.039313
C  -2.568201 -0.746527 0.020521
C  -3.868245 -0.053566 0.031746
H  1.163199 1.081608 0.878058
H  1.1457 1.088264 -0.898344
H  0.030967 -1.188112 -0.895456
H  0.048444 -1.193255 0.882126
H  2.637896 -0.990196 0.861558
H  2.596861 -0.994561 -0.916223
H  -1.42923 0.889139 -0.875558
H  -1.411838 0.885353 0.900874
H  3.758444 1.231393 0.879506
H  3.667453 1.319525 -0.90123
H  -2.51256 -1.406058 0.908473
H  -2.527697 -1.40513 -0.868966
H  5.87608 0.3985 0.122617
H  5.138048 -0.768917 -0.864133
