program: Orca
programVersion: 4.2.1
elementType: O C C C C H H H O H H C H H C C C C C C H H H H O C H H H
charge: 0
multiplicity: 1
keywords: RKS wB97M-V def2-TZVPP def2-TZVPP/C def2/J RIJCOSX TightSCF GRID6 CPCM NBO
formula: C12H14O3
InChI: InChI=1S/C12H14O3/c1-14-11-4-2-9(3-5-11)8-10-6-7-15-12(10)13/h2-5,10H,6-8H2,1H3
29 atoms
O  -3.795332 -1.148331 -0.359846
C  -2.49371 -0.821777 -0.518908
C  -4.413443 -0.294752 0.620882
C  -3.514114 0.918973 0.702295
C  -2.144545 0.318053 0.418822
H  -1.775205 -0.162369 1.346226
H  -3.774344 1.644669 -0.085414
H  -5.43844 -0.087673 0.289207
O  -1.79054 -1.393763 -1.310114
H  -4.465238 -0.843036 1.575664
H  -3.581266 1.437226 1.667178
C  -1.101155 1.285079 -0.111846
H  -1.369909 1.562043 -1.146971
H  -1.195942 2.226568 0.455536
C  0.340174 0.8498 -0.069231
C  1.337403 1.761442 -0.459146
C  0.760721 -0.414113 0.349091
C  2.683617 1.430188 -0.430813
C  2.11295 -0.768149 0.387771
C  3.087142 0.155435 -0.003301
H  1.04402 2.76173 -0.793225
H  0.027136 -1.166714 0.645636
H  3.448801 2.147621 -0.73583
H  2.391418 -1.769697 0.719123
O  4.418034 -0.088103 -0.002732
C  4.854066 -1.357198 0.421693
H  4.568544 -1.564462 1.466286
H  4.460978 -2.164809 -0.217589
H  5.947512 -1.357408 0.351852
elementType: O C H
totalener: -691.41372293 hartree
nucrepener: 959.45532740 hartree
electener: -1650.86905034 hartree
oneelecener: -2843.61347501 hartree
twoeener: 1192.74442468 hartree
cpcmener: -0.01941833 hartree
kineticenergy: 689.20926380 hartree
exchangeener: -64.483266561833 hartree
correlationener: -3.533484516245 hartree
xcener: -67.603575729630 hartree
chargesum: -0.0000000
charge: -0.238135 0.283988 -0.033960 -0.219591 -0.034606 0.132202 0.115292 0.121638 -0.342768 0.121921 0.113841 -0.209029 0.120176 0.127758 0.010168 -0.164673 -0.167277 -0.201521 -0.213185 0.238243 0.138856 0.125927 0.132441 0.137974 -0.287094 -0.211168 0.133910 0.134940 0.133733
charge: 0.281962 -0.421682 -0.063683 -0.009528 -0.082423 0.056090 0.035081 0.021838 0.092673 0.021750 0.031505 -0.007725 0.042914 0.043827 -0.089769 -0.010198 -0.012797 -0.024211 -0.038743 -0.223942 0.033098 0.027677 0.028254 0.025415 0.275386 -0.067621 0.009987 0.010202 0.014661
qa: -0.2381 0.2840 -0.0340 -0.2196 -0.0346 0.1322 0.1153 0.1216 -0.3428 0.1219 0.1138 -0.2090 0.1202 0.1278 0.0102 -0.1647 -0.1673 -0.2015 -0.2132 0.2382 0.1389 0.1259 0.1324 0.1380 -0.2871 -0.2112 0.1339 0.1349 0.1337
va: 2.1136 4.3545 3.8356 3.8904 3.6021 0.9972 0.9958 0.9806 2.1681 0.9782 0.9949 3.8283 0.9873 0.9820 3.6703 3.9529 3.9383 3.9352 3.8758 3.8431 0.9929 1.0153 1.0083 1.0057 2.0726 3.8388 0.9691 0.9684 0.9827
energy: -691.413722932380
dipole: 0.27011 -1.09642 -0.82631 2.62664 -1.74685 0.87979 5.52058 -3.79019 1.73039
magnitude: 2.10976 au
magnitude: 5.36258 debye
