program: Gaussian 09
title: 000031732
version: EM64L-G09RevD.01
frameworkgroup: C1[X(C18H22N2)]
method: RPBEPBE
basis: SDD
operation: Freq
keyword: #pfreq=noraman
keyword: PBEPBE/SDD
title: #p freq=noraman PBEPBE/SDD
converged: YES YES NO NO
title: Mulliken charges:
elementType: N N C C C C C C C C C C C C C C C C C C H H H H H H H H H H H H H H H H H H H H H H
charge: -0.078434 -0.021289 -0.262459 -0.454803 0.369305 -0.071037 0.348492 -0.619869 -0.552860 0.323270 -0.351212 -0.449950 -0.442045 -0.317180 -0.250794 -0.243680 -0.192418 -0.379684 -0.624597 -0.618769 0.229753 0.218076 0.239757 0.213941 0.226090 0.215211 0.243007 0.169496 0.235174 0.241163 0.233285 0.238208 0.226759 0.225617 0.228773 0.238698 0.232432 0.185365 0.217463 0.228703 0.218576 0.184468
chargesum: 0.00000
title: Mulliken charges with hydrogens summed into heavy atoms:
elementType: N N C C C C C C C C C C C C C C C C C C
charge: -0.078434 -0.021289 -0.032706 0.003031 0.369305 -0.071037 0.348492 -0.179839 -0.094642 0.323270 0.053458 -0.208787 -0.208760 -0.078971 -0.024035 -0.018062 0.036355 -0.140986 0.010663 0.012978
polarizability: 2.13585940e+02 2.88431783e+01 2.22330932e+02 1.94293876e+01 -1.55279002e+01 1.66175712e+02
1716.lowfreq: -23.1654 -9.2941 -4.1849 -0.0005 0.0001 0.0004 4.4329 30.6836 41.5774
frequency: -21.2684 30.4720 41.5442 53.8104 90.6691 100.9116 134.4499 144.8082 184.0623 220.1102 220.4195 236.6321 245.3966 270.1416 295.8820 312.7892 334.7040 344.7536 383.2177 418.8310 430.9248 454.9195 468.3972 486.1271 536.0474 545.9382 581.9992 586.6795 615.4762 640.4521 692.9961 736.6689 757.5499 766.4204 773.1876 784.8236 801.2595 812.5998 839.3837 870.3124 884.3550 920.5019 932.7774 949.6862 963.2149 979.8181 987.5845 992.2512 1021.3063 1031.2033 1034.2518 1042.9275 1050.1965 1059.3442 1072.0848 1089.7736 1094.7632 1106.4350 1129.7823 1158.8677 1164.1554 1174.1702 1175.2776 1185.2448 1208.4212 1215.6798 1223.4438 1229.5189 1244.0409 1262.8081 1284.8946 1288.7814 1302.9135 1307.9553 1322.3260 1325.2878 1353.9091 1360.8440 1375.7686 1387.4304 1416.4266 1419.7731 1435.7806 1439.2371 1441.0549 1455.2364 1456.6444 1460.5786 1468.3461 1475.9306 1476.0567 1481.0143 1487.0449 1489.3135 1554.2905 1580.8323 1591.9491 1610.1904 2815.1934 2841.1286 2856.7743 2962.7685 2993.4008 2997.2394 3003.2257 3016.0466 3016.9263 3024.2729 3028.5148 3048.5993 3068.4755 3075.8774 3087.1245 3112.8248 3117.3252 3118.4667 3124.0574 3136.7543 3158.9269 3162.1293
redmass: 2.5120 4.0190 4.3245 4.4443 3.6110 2.5413 2.8905 2.9098 3.1727 2.6871 2.0708 1.2925 1.2761 3.8660 3.4874 4.8016 2.6662 2.7125 2.9799 2.5713 2.8682 2.9786 3.0915 4.0850 4.2324 3.4406 2.7957 3.1617 6.3761 5.1652 3.7979 3.2392 2.5013 1.4961 2.5941 2.0991 1.5838 3.5498 2.5727 2.0376 1.7088 2.6272 1.4301 1.4793 2.0593 1.5260 1.4195 2.9140 2.5428 1.5442 2.7814 2.0418 2.4299 2.5492 2.2234 1.4678 2.1538 1.8620 1.3462 1.4267 1.4616 1.1542 1.3969 2.0364 2.4483 1.6295 1.7942 1.5984 1.4973 2.4964 1.4030 1.4798 1.3355 1.2219 2.3037 1.9279 1.7644 1.5007 1.3926 3.4424 1.1463 2.0021 2.1422 2.1015 1.1826 1.1716 1.1474 1.0580 1.0852 1.0604 1.1051 1.0826 1.0806 2.3566 5.6947 5.9308 6.7255 6.3597 1.0700 1.0575 1.0576 1.0607 1.0650 1.0739 1.0685 1.0718 1.0938 1.0833 1.0744 1.1015 1.1022 1.1007 1.0998 1.0863 1.0877 1.0888 1.0913 1.0929 1.1006 1.0995
irintensity: 0.7176 0.5901 0.0637 1.4176 0.2788 0.8550 0.1398 0.7425 0.0566 1.3383 0.1088 1.6422 0.0081 6.1423 4.1941 1.4135 6.3073 5.2309 0.1633 0.5632 0.9986 2.7645 0.4199 2.2686 1.2579 2.7104 24.4413 2.1371 5.4655 2.7436 6.2442 0.1491 17.6134 33.1314 9.8065 16.8126 38.6371 9.1868 9.9151 6.9379 2.8057 5.2927 0.4485 1.8299 1.6450 1.5957 0.7608 7.8547 13.3790 14.3260 8.1314 17.7344 9.8401 3.8277 21.6768 4.6861 14.3405 8.0157 7.1377 5.6498 12.1427 1.8003 0.7395 3.4127 0.4914 1.1002 11.7504 1.2338 1.2317 6.3775 2.2568 13.0021 7.0489 7.7640 2.3916 1.1445 1.0769 2.8000 7.5374 0.4008 4.0070 23.4308 51.2738 2.0373 3.2301 19.3013 4.4014 23.7549 12.1092 5.3683 14.7126 14.4925 27.8023 13.9590 29.0767 5.1063 0.4320 0.6437 63.3592 68.3339 232.0783 25.3705 16.2813 2.3500 16.5066 40.2844 49.3989 33.8359 34.4603 36.0236 21.5020 41.4197 42.9629 11.5220 6.7966 3.2880 27.9438 28.9015 36.7281 35.9098
temp: 298.150 k
press: 1.00000 atm
elementType: 7 7 6 6 6 6 6 6 6 6 6 6 6 6 6 6 6 6 6 6 1 1 1 1 1 1 1 1 1 1 1 1 1 1 1 1 1 1 1 1 1 1
symmnumber: 1
zpe: 936948.3 jmol-1
zpe.correction: 0.356865 hartree
zpe.thermalcorrener: 0.374298 hartree
zpe.thermalcorrenthalpy: 0.375242 hartree
zpe.thermalcorrgfe: 0.311365 hartree
zpe.sumelectzpe: -807.130169 hartree
zpe.sumelectthermal: -807.112736 hartree
zpe.sumelectthermalent: -807.111792 hartree
zpe.sumelectthermalfe: -807.175669 hartree
dipole: -1.0207 0.6915 -1.0318
dipole: 1.6077
quadrupole: -107.9016 -114.2954 -119.4880
quadrupole: 2.0545 8.2212 -1.9930
quadrupole: 5.9934 -0.4004 -5.5930 2.0545 8.2212 -1.9930
hfenergy: -807.4870341 hartree
pointgroup: C01 [X(C18H22N2)]
dipole: -0.3426965 0.3354067 -0.412457 debye
polarizability: 223.4563367|28.9137467|211.7967331|16.8475437|-18.7049828|166.8395142 unknown
InChI: InChI=1S/C18H22N2/c1-20(2)13-11-17-16-8-4-3-6-14(16)9-10-15-7-5-12-19-18(15)17/h3-8,12,17H,9-11,13H2,1-2H3
charge 0 multiplicity 1
42 atoms
N  3.031577 -2.386778 -0.610052
N  -2.037183 -1.584467 1.153777
C  -0.061847 -0.324179 0.617216
C  0.762225 -1.364658 -0.223872
C  0.479187 1.100958 0.502377
C  -1.562304 -0.551856 0.374304
C  0.339451 1.896074 -0.671928
C  -0.512957 1.423576 -1.837844
C  -2.007314 1.301056 -1.451539
C  -2.409277 0.135852 -0.548792
C  2.239223 -1.441227 0.212765
C  1.21288 1.627987 1.59597
C  0.943332 3.176939 -0.71907
C  -3.766803 -0.284486 -0.618317
C  1.809769 2.907316 1.543254
C  1.679521 3.687393 0.373491
C  -4.251009 -1.334322 0.183848
C  -3.337507 -1.961913 1.059268
C  2.66894 -3.801799 -0.390926
C  4.484535 -2.17078 -0.451537
H  0.073571 -0.640123 1.669853
H  0.731628 -1.130895 -1.303236
H  0.267313 -2.343326 -0.083121
H  -0.429327 2.152843 -2.665033
H  -0.159627 0.454342 -2.23574
H  -2.60581 1.224228 -2.380867
H  -2.315928 2.249624 -0.96566
H  2.286027 -1.702725 1.30507
H  2.698131 -0.441033 0.10378
H  1.316856 1.021791 2.504287
H  0.83007 3.782998 -1.626781
H  -4.441656 0.224612 -1.317947
H  2.369349 3.287993 2.405006
H  2.139437 4.680171 0.31344
H  -5.294704 -1.659881 0.132729
H  -3.647899 -2.788467 1.709449
H  1.605064 -3.969497 -0.627706
H  2.847228 -4.140685 0.662657
H  3.267654 -4.442835 -1.062828
H  4.735048 -1.124331 -0.70091
H  5.036786 -2.829723 -1.146111
H  4.855853 -2.377769 0.585578
