program: Orca
programVersion: 4.2.1
elementType: C O O C C C C C C H H H H H C C C C C C H H H H H
charge: 0
multiplicity: 1
keywords: RKS wB97M-V def2-TZVPP def2-TZVPP/C def2/J RIJCOSX TightSCF GRID6 CPCM NBO
formula: C13H10O2
InChI: InChI=1S/C13H10O2/c14-13(11-7-3-1-4-8-11)15-12-9-5-2-6-10-12/h1-10H
25 atoms
C  -0.416758 0.566556 -0.210915
O  -0.03753 1.653436 -0.571444
O  0.42595 -0.456608 0.101205
C  -1.834395 0.164679 -0.066224
C  -2.817078 1.111682 -0.388626
C  -2.218522 -1.109381 0.37654
C  -4.164922 0.789994 -0.271041
C  -3.569002 -1.42661 0.493737
C  -4.542208 -0.479823 0.170418
H  -2.503453 2.100039 -0.731354
H  -1.456747 -1.848701 0.62783
H  -4.926368 1.531194 -0.523761
H  -3.865145 -2.419641 0.839282
H  -5.60117 -0.732896 0.26314
C  1.796232 -0.259571 0.071181
C  2.403518 0.752095 0.814332
C  2.552487 -1.160602 -0.674875
C  3.792973 0.857494 0.79971
C  3.941905 -1.04572 -0.677448
C  4.565254 -0.03635 0.056146
H  1.795564 1.443297 1.399525
H  2.045092 -1.943265 -1.242189
H  4.275426 1.64739 1.380256
H  4.538733 -1.75176 -1.259613
H  5.653806 0.053058 0.051192
elementType: C O H
totalener: -651.89938299 hartree
nucrepener: 873.66032450 hartree
electener: -1525.55970750 hartree
oneelecener: -2617.03169503 hartree
twoeener: 1091.47198753 hartree
cpcmener: -0.01225623 hartree
kineticenergy: 649.76909873 hartree
exchangeener: -61.424029184039 hartree
correlationener: -3.353300568629 hartree
xcener: -64.384513982634 hartree
chargesum: 0.0000000
charge: 0.386050 -0.352751 -0.271023 0.015687 -0.154102 -0.172988 -0.149415 -0.149245 -0.128457 0.153535 0.153872 0.157652 0.157927 0.160054 0.240851 -0.165444 -0.204654 -0.140499 -0.130740 -0.162928 0.142901 0.148084 0.156232 0.155901 0.153501
charge: -0.398865 0.113132 0.327437 -0.095679 0.021888 0.014597 -0.014956 -0.015285 -0.000188 0.034766 0.031374 0.031628 0.031637 0.032900 -0.189768 -0.008375 -0.010989 -0.017167 -0.018035 -0.027570 0.033822 0.033248 0.031288 0.030965 0.028196
qa: 0.3860 -0.3528 -0.2710 0.0157 -0.1541 -0.1730 -0.1494 -0.1492 -0.1285 0.1535 0.1539 0.1577 0.1579 0.1601 0.2409 -0.1654 -0.2047 -0.1405 -0.1307 -0.1629 0.1429 0.1481 0.1562 0.1559 0.1535
va: 4.1835 2.1709 2.0957 3.5126 3.9493 3.9518 3.9004 3.8948 3.8803 1.0127 1.0105 0.9877 0.9875 0.9844 3.7239 3.9283 3.9620 3.8793 3.8809 3.8820 1.0042 0.9984 0.9861 0.9853 0.9869
energy: -651.899382994256
dipole: -0.03758 -0.49061 -0.52819 -1.87457 1.05525 -0.81932 0.78523 -0.45711 0.32812
magnitude: 1.02856 au
magnitude: 2.61438 debye
