program: Orca
programVersion: 4.2.1
elementType: O C O C H H C H H H C H H C H H C H H C H H C H H C H H C H H C H H C H H C H H C H H C H H H
charge: 0
multiplicity: 1
keywords: RKS wB97M-V def2-TZVPP def2-TZVPP/C def2/J RIJCOSX TightSCF GRID6 CPCM NBO
formula: C15H30O2
InChI: InChI=1S/C15H30O2/c1-3-4-5-6-7-8-9-10-11-12-13-14-15(16)17-2/h3-14H2,1-2H3
47 atoms
O  -7.952257 0.149791 -0.034251
C  -6.778273 -0.500682 -0.013383
O  -6.790709 -1.705146 -0.014066
C  -5.518178 0.326195 0.013233
H  -5.551942 0.979722 0.903182
H  -5.532325 1.015767 -0.849052
C  -8.025721 1.563659 -0.046276
H  -7.558813 2.009452 0.846195
H  -9.094005 1.816703 -0.046069
H  -7.563442 1.991733 -0.949958
C  -4.252094 -0.511061 0.009579
H  -4.251476 -1.160247 -0.88213
H  -4.26808 -1.194959 0.8746
C  -2.986399 0.333263 0.037204
H  -2.986467 1.023229 -0.826823
H  -2.994197 0.97819 0.935293
C  -1.706815 -0.491318 0.020513
H  -1.701569 -1.136352 -0.877326
H  -1.706082 -1.181271 0.88429
C  -0.43716 0.348498 0.044422
H  -0.443263 1.042808 -0.816173
H  -0.440281 0.989518 0.945412
C  0.844378 -0.473108 0.016502
H  0.852023 -1.167356 0.877017
H  0.846629 -1.114181 -0.884383
C  2.113202 0.368274 0.037471
H  2.102293 1.065506 -0.820713
H  2.11298 1.006414 0.940517
C  3.395973 -0.451146 0.001587
H  3.407962 -1.148398 0.859673
H  3.395857 -1.089123 -0.901539
C  4.66381 0.391792 0.020908
H  4.64975 1.090854 -0.835732
H  4.665042 1.027945 0.925354
C  5.947403 -0.426167 -0.01979
H  5.961679 -1.125393 0.836698
H  5.945897 -1.062007 -0.92446
C  7.214617 0.417525 -0.000931
H  7.19986 1.11786 -0.856774
H  7.217006 1.052828 0.904354
C  8.499816 -0.398973 -0.043713
H  8.512619 -1.098609 0.811515
H  8.495584 -1.033075 -0.948694
C  9.758619 0.453157 -0.02419
H  9.792076 1.138243 -0.887783
H  9.80915 1.072195 0.887127
H  10.670185 -0.164618 -0.055905
elementType: O C H
totalener: -740.06783505 hartree
nucrepener: 1103.79429745 hartree
electener: -1843.86213250 hartree
oneelecener: -3190.79283393 hartree
twoeener: 1346.93070143 hartree
cpcmener: -0.01407501 hartree
kineticenergy: 737.39355900 hartree
exchangeener: -72.299131428582 hartree
correlationener: -4.080853256688 hartree
xcener: -75.867171269845 hartree
chargesum: 0.0000000
charge: -0.231069 0.325345 -0.355470 -0.264330 0.142980 0.141299 -0.202056 0.137168 0.143637 0.137875 -0.187631 0.096142 0.096151 -0.164592 0.091121 0.091217 -0.184812 0.090392 0.090794 -0.174442 0.088898 0.089142 -0.177982 0.089319 0.089208 -0.177254 0.088814 0.088952 -0.174030 0.089028 0.088702 -0.177980 0.088655 0.088664 -0.169455 0.087637 0.087405 -0.166648 0.086458 0.086639 -0.141317 0.083146 0.082953 -0.355168 0.102364 0.101740 0.112388
charge: 0.287871 -0.441194 0.083454 -0.036738 0.043542 0.042972 -0.053291 0.011506 0.018454 0.011447 -0.034208 0.027351 0.027161 -0.041270 0.023429 0.023412 -0.042027 0.023044 0.023007 -0.043577 0.022213 0.022166 -0.043550 0.022179 0.022213 -0.043938 0.022038 0.021998 -0.043816 0.022041 0.022056 -0.043988 0.022017 0.021994 -0.044071 0.021974 0.021978 -0.046472 0.021651 0.021640 -0.056393 0.019377 0.019370 -0.016936 0.012937 0.012892 0.012082
qa: -0.2311 0.3253 -0.3555 -0.2643 0.1430 0.1413 -0.2021 0.1372 0.1436 0.1379 -0.1876 0.0961 0.0962 -0.1646 0.0911 0.0912 -0.1848 0.0904 0.0908 -0.1744 0.0889 0.0891 -0.1780 0.0893 0.0892 -0.1773 0.0888 0.0890 -0.1740 0.0890 0.0887 -0.1780 0.0887 0.0887 -0.1695 0.0876 0.0874 -0.1666 0.0865 0.0866 -0.1413 0.0831 0.0830 -0.3552 0.1024 0.1017 0.1124
va: 2.0803 4.3162 2.1470 3.6705 0.9832 0.9834 3.8295 0.9688 0.9806 0.9694 3.8510 1.0020 1.0026 3.7607 0.9933 0.9936 3.7969 0.9941 0.9940 3.7781 0.9943 0.9943 3.7823 0.9943 0.9944 3.7785 0.9942 0.9943 3.7793 0.9944 0.9946 3.7822 0.9944 0.9945 3.7804 0.9946 0.9947 3.7740 0.9934 0.9935 3.7996 0.9907 0.9906 3.8779 0.9862 0.9865 0.9887
energy: -740.067835046968
dipole: 43.53035 -43.02936 0.50099 7.07961 -5.00406 2.07555 0.07055 -0.06485 0.00570
magnitude: 2.13516 au
magnitude: 5.42716 debye
