program: Orca
programVersion: 4.2.1
elementType: C O O C H H H C C C C C C F F F F F
charge: 0
multiplicity: 1
keywords: RKS wB97M-V def2-TZVPP def2-TZVPP/C def2/J RIJCOSX TightSCF GRID6 CPCM NBO
formula: C8H3F5O2
InChI: InChI=1S/C8H3F5O2/c1-15-8(14)2-3(9)5(11)7(13)6(12)4(2)10/h1H3
18 atoms
C  -2.039909 0.398558 -0.173249
O  -2.537183 1.330703 -0.75708
O  -2.731589 -0.544888 0.468037
C  -4.152045 -0.427368 0.394704
H  -4.49158 0.50946 0.855044
H  -4.493679 -0.455429 -0.647949
H  -4.558941 -1.281093 0.943535
C  -0.57184 0.163684 -0.069098
C  0.302239 1.256668 0.010769
C  -0.003823 -1.117372 -0.093687
C  1.681151 1.084735 0.073291
C  1.374581 -1.3027 -0.044719
C  2.218282 -0.19928 0.041071
F  1.888219 -2.525148 -0.088178
F  3.527954 -0.370085 0.09305
F  -0.756685 -2.202704 -0.206787
F  2.485068 2.134974 0.172569
F  -0.16205 2.496184 0.065703
elementType: C O H F
totalener: -956.43947621 hartree
nucrepener: 1046.01904060 hartree
electener: -2002.45851681 hartree
oneelecener: -3396.42207248 hartree
twoeener: 1393.96355567 hartree
cpcmener: -0.00915847 hartree
kineticenergy: 954.01906644 hartree
exchangeener: -78.799507915174 hartree
correlationener: -4.005396616224 hartree
xcener: -82.366221189906 hartree
chargesum: 0.0000000
charge: 0.358051 -0.350408 -0.251362 -0.191107 0.139185 0.140829 0.143524 -0.016980 0.191274 0.194020 0.155498 0.157111 0.203208 -0.180892 -0.171135 -0.171572 -0.180141 -0.169102
charge: -0.437514 0.113360 0.299258 -0.029229 0.014360 0.013875 0.016636 -0.072268 -0.201547 -0.205882 -0.228263 -0.228653 -0.213778 0.224699 0.239068 0.233232 0.225412 0.237234
qa: 0.3581 -0.3504 -0.2514 -0.1911 0.1392 0.1408 0.1435 -0.0170 0.1913 0.1940 0.1555 0.1571 0.2032 -0.1809 -0.1711 -0.1716 -0.1801 -0.1691
va: 4.2268 2.1539 2.1040 3.8337 0.9772 0.9783 0.9806 3.3513 3.9721 3.9715 3.8958 3.9007 3.8598 1.1169 1.1348 1.1279 1.1180 1.1367
energy: -956.439476207411
dipole: -19.09295 18.50596 -0.58699 -0.70117 0.02321 -0.67796 1.03281 -0.60015 0.43265
magnitude: 0.99568 au
magnitude: 2.53082 debye
