program: Orca
programVersion: 4.2.1
elementType: C O O C H H H C C C C C C H H H H C F F F
charge: 0
multiplicity: 1
keywords: RKS wB97M-V def2-TZVPP def2-TZVPP/C def2/J RIJCOSX TightSCF GRID6 CPCM NBO
formula: C9H7F3O2
InChI: InChI=1S/C9H7F3O2/c1-14-8(13)6-3-2-4-7(5-6)9(10,11)12/h2-5H,1H3
21 atoms
C  2.327807 -0.516032 0.000593
O  2.360026 -1.726414 -0.001626
O  3.423967 0.253342 0.001918
C  4.667574 -0.440391 -0.000763
H  4.765939 -1.076302 0.889014
H  4.765548 -1.069603 -0.895375
H  5.4494 0.324651 0.001844
C  1.077305 0.28781 0.001026
C  -0.138021 -0.400782 -0.004986
C  1.078535 1.689819 0.003918
C  -1.340509 0.304479 -0.0096
C  -0.124879 2.388017 0.000499
C  -1.33808 1.700605 -0.006544
H  -0.129124 -1.493282 -0.007514
H  2.027013 2.228538 0.007938
H  -0.121973 3.479743 0.0020
H  -2.281246 2.249487 -0.011055
C  -2.622569 -0.47268 -0.001441
F  -2.658036 -1.384187 -0.989909
F  -2.781224 -1.157565 1.147126
F  -3.701903 0.308005 -0.144483
elementType: C O H F
totalener: -797.28368728 hartree
nucrepener: 894.42855248 hartree
electener: -1691.71223977 hartree
oneelecener: -2870.17789195 hartree
twoeener: 1178.46565218 hartree
cpcmener: -0.01003111 hartree
kineticenergy: 795.07411639 hartree
exchangeener: -68.400532778713 hartree
correlationener: -3.562848430073 hartree
xcener: -71.561381269660 hartree
chargesum: -0.0000000
charge: 0.395331 -0.379449 -0.263223 -0.195702 0.136786 0.137182 0.138163 0.003354 -0.129513 -0.145859 -0.037692 -0.147859 -0.102369 0.151563 0.157072 0.159930 0.157987 0.501048 -0.179547 -0.179450 -0.177755
charge: -0.425920 0.094410 0.290945 -0.037100 0.012887 0.012988 0.014939 -0.082342 0.052713 0.031665 -0.096738 -0.000515 0.031316 0.043420 0.035454 0.035945 0.037843 -0.627151 0.189155 0.185056 0.201029
qa: 0.3953 -0.3794 -0.2632 -0.1957 0.1368 0.1372 0.1382 0.0034 -0.1295 -0.1459 -0.0377 -0.1479 -0.1024 0.1516 0.1571 0.1599 0.1580 0.5010 -0.1795 -0.1795 -0.1778
va: 4.2181 2.1446 2.1000 3.8425 0.9779 0.9777 0.9813 3.6051 4.0320 3.9559 3.6883 3.9335 3.9249 1.0321 1.0080 0.9876 0.9981 4.5105 1.1112 1.1057 1.1221
energy: -797.283687280083
dipole: 22.57422 -21.35613 1.21809 6.53088 -4.85236 1.67852 -0.02461 0.01462 -0.00999
magnitude: 2.07395 au
magnitude: 5.27156 debye
